program: Gaussian 09
title: 000195046
version: EM64L-G09RevD.01
frameworkgroup: C1[X(C19H32O5)]
method: RPBEPBE
basis: SDD
operation: Freq
keyword: #pfreq=noraman
keyword: PBEPBE/SDD
title: #p freq=noraman PBEPBE/SDD
converged: YES YES NO NO
title: Mulliken charges:
elementType: O O O O O C C C C C C C C C C C C C C C C C C C H H H H H H H H H H H H H H H H H H H H H H H H H H H H H H H H
charge: -0.451572 -0.437036 -0.471478 -0.401727 -0.262477 -0.205792 -0.060185 -0.108003 0.475198 -0.480816 -0.447001 -0.027905 -0.637908 -0.155652 -0.441520 -0.512591 -0.777166 -0.471196 -0.734778 -0.079958 -0.458526 -0.053544 -0.513966 0.201035 0.218830 0.184718 0.224815 0.209620 0.214963 0.223654 0.202928 0.202260 0.218196 0.212948 0.215409 0.198073 0.206086 0.232279 0.235573 0.212361 0.223510 0.199346 0.212169 0.213591 0.214783 0.221013 0.263617 0.329620 0.235355 0.185858 0.207981 0.316420 0.254297 0.270432 0.370358 0.383503
chargesum: 0.00000
title: Mulliken charges with hydrogens summed into heavy atoms:
elementType: O O O O O C C C C C C C C C C C C C C C C C C C
charge: -0.121952 -0.120616 -0.101120 -0.018224 -0.262477 0.013038 0.124533 0.116812 0.475198 -0.056234 -0.020420 0.174354 -0.206764 0.059757 -0.037361 -0.280311 -0.105721 -0.059681 -0.085391 0.183658 -0.037313 0.154437 0.010763 0.201035
polarizability: 2.42655189e+02 8.22987648e+00 2.11881428e+02 -1.06731558e+01 -8.70508980e+00 1.94963656e+02
1716.lowfreq: -8.2766 -1.7222 -0.2829 -0.0010 -0.0007 0.0005 13.7931 19.1316 26.2894
frequency: 7.8935 18.7922 26.2868 41.1058 50.9987 55.5361 66.4403 76.1467 79.6113 108.0334 122.1320 132.1144 142.9930 159.7908 177.5929 186.2703 190.8423 235.4206 243.3430 246.9490 261.3310 270.4668 291.4847 296.8799 314.8301 331.4612 336.7165 345.7592 375.3263 378.5929 397.1857 424.3727 445.0273 447.3466 467.5737 483.5078 497.2651 508.6815 527.6179 556.7692 571.3382 592.1163 594.3361 628.0506 655.1925 671.2179 718.4724 742.8873 773.5174 781.9039 809.0455 817.8493 839.7446 845.9166 858.4440 874.2556 876.4843 896.0879 904.3615 922.5837 951.6783 968.5006 971.0814 978.1572 986.6163 994.5204 1018.3479 1024.2132 1035.5507 1045.3134 1046.8045 1062.4626 1069.6454 1077.8651 1081.4612 1085.7129 1096.1220 1106.4652 1113.9515 1125.7853 1146.7417 1154.4586 1166.0777 1178.5470 1182.2962 1190.9423 1203.2782 1205.9656 1217.7788 1238.3041 1243.7724 1254.4682 1265.1213 1273.0857 1282.3274 1284.1651 1293.8003 1298.1275 1304.2726 1315.2458 1322.8010 1324.3842 1331.2209 1334.8625 1337.1233 1343.9774 1349.0143 1353.4527 1356.7104 1359.3459 1362.0358 1368.4228 1371.4660 1375.4428 1389.3639 1393.7522 1398.9243 1415.5461 1445.9593 1453.2035 1454.8230 1460.3236 1468.5307 1472.2668 1474.7218 1481.3649 1488.4079 1492.1497 1637.6409 1666.9561 2906.1169 2920.2650 2939.0249 2944.1372 2956.2889 2960.3610 2964.3954 2972.9310 2976.7982 2977.2191 2983.7648 2985.8605 2995.7245 2999.5677 3009.8471 3020.7469 3022.0225 3026.4005 3040.0478 3041.0242 3044.8560 3064.9980 3067.0746 3067.1397 3072.4598 3075.6558 3080.2572 3103.8387 3462.4026 3502.1044 3527.8955 3553.4955
redmass: 5.1194 5.2438 7.1138 3.5592 4.9706 4.2359 4.8455 3.8877 3.2329 3.1434 4.1978 3.1919 3.5872 3.5981 1.5349 1.1498 1.6404 4.0822 2.7761 1.3294 2.9755 2.9087 2.4790 1.8778 1.3949 2.5625 4.6481 3.0756 2.4393 2.6424 2.8796 3.2770 2.7056 2.1888 3.0282 3.7434 2.7857 2.4654 3.2514 2.9380 3.0736 1.5806 1.5904 2.2222 2.2302 1.9085 2.6213 1.7832 2.8367 2.4405 2.2466 2.4731 2.6921 1.6752 2.2811 3.0001 1.8485 2.2215 2.3376 2.3023 2.4301 2.4218 1.7718 1.8731 2.0524 2.0595 1.8142 2.2621 1.7338 2.1102 2.9981 2.1920 2.1384 2.3048 2.3524 1.5781 2.2282 1.7894 1.3819 2.2245 1.8683 1.4606 1.3587 1.3444 1.8285 1.6486 1.3713 1.2469 1.3442 1.4078 1.3824 1.3092 1.2752 1.4073 1.4956 1.2711 1.3313 1.2605 1.2718 1.3405 1.3732 1.3783 1.4891 1.4790 1.4517 1.4142 1.4752 1.5631 1.5309 1.2475 1.5242 1.4329 1.4536 1.5196 1.2281 1.2082 1.6546 1.1182 1.0913 1.0823 1.0922 1.0753 1.0764 1.0719 1.0560 1.0555 1.0615 1.0641 7.5996 7.8205 1.0788 1.0826 1.0833 1.0647 1.0607 1.0650 1.0623 1.0414 1.0482 1.0503 1.0762 1.0586 1.0624 1.0833 1.0955 1.0858 1.0972 1.0970 1.0994 1.0979 1.1008 1.0985 1.0973 1.0993 1.0990 1.0987 1.0889 1.0912 1.0651 1.0638 1.0658 1.0662
irintensity: 1.2971 0.0594 2.3527 0.1531 1.7904 2.7251 0.5956 0.4052 0.1203 0.6139 1.1024 0.5570 6.5278 1.0993 0.0761 0.6483 3.5918 9.2568 61.2761 77.6848 0.5548 1.6842 12.7888 20.0002 95.4462 22.0611 6.4455 1.9761 7.3285 7.8588 27.3234 4.1065 11.7460 6.3036 6.6576 1.4877 6.0609 7.1890 51.2471 21.5754 5.9734 95.5912 111.4630 71.3050 3.6903 94.1444 8.7190 3.7144 4.7118 1.2431 7.3770 23.8232 0.7232 9.2886 7.7904 1.7203 2.6660 19.1834 45.9238 34.7841 27.4064 18.7420 1.9430 10.3596 10.5422 21.3898 31.8759 1.8314 13.8864 8.8067 104.1609 10.0093 16.7132 245.4765 10.9998 21.1916 2.1713 4.3833 2.0096 6.1036 10.1522 19.9417 13.4202 9.3590 9.4580 1.7912 22.8580 4.8715 7.3594 5.5967 18.1748 11.1293 43.5829 1.1930 4.2425 5.0055 3.9776 13.1939 0.8224 6.3286 1.5603 1.3517 4.3103 4.1041 4.2758 8.0191 36.6482 30.0355 7.7757 27.4117 1.6122 6.2314 26.8959 15.2879 22.7782 25.3417 55.4538 26.4508 14.8038 1.1924 12.3540 2.5389 14.5295 4.2094 15.1309 3.5023 6.8700 6.5121 187.6779 16.4230 3.5100 35.1169 47.4419 25.8261 11.9983 21.0526 32.5072 20.3072 21.5539 68.4256 71.5368 21.3283 9.0517 31.3250 7.0339 47.0978 35.7668 32.1224 31.5225 75.3103 42.1801 33.1601 7.9580 37.7139 61.7172 42.0375 22.3170 30.5866 79.2541 21.0740 4.0552 4.5259
temp: 298.150 k
press: 1.00000 atm
elementType: 8 8 8 8 8 6 6 6 6 6 6 6 6 6 6 6 6 6 6 6 6 6 6 6 1 1 1 1 1 1 1 1 1 1 1 1 1 1 1 1 1 1 1 1 1 1 1 1 1 1 1 1 1 1 1 1
symmnumber: 1
zpe: 1267971.3 jmol-1
zpe.correction: 0.482945 hartree
zpe.thermalcorrener: 0.509459 hartree
zpe.thermalcorrenthalpy: 0.510403 hartree
zpe.thermalcorrgfe: 0.423463 hartree
zpe.sumelectzpe: -1117.412820 hartree
zpe.sumelectthermal: -1117.386306 hartree
zpe.sumelectthermalent: -1117.385361 hartree
zpe.sumelectthermalfe: -1117.472302 hartree
dipole: -1.2159 0.1909 1.1640
dipole: 1.6940
quadrupole: -119.3926 -144.4466 -164.2814
quadrupole: 4.6710 -18.1464 3.0198
quadrupole: 23.3142 -1.7397 -21.5745 4.6710 -18.1464 3.0198
hfenergy: -1117.8957646 hartree
pointgroup: C01 [X(C19H32O5)]
dipole: 0.4931199 -0.437548 -0.0978903 debye
polarizability: 244.0737092|-9.0862178|194.2905557|7.2277126|-8.1286843|211.1360079 unknown
InChI: InChI=1S/C19H32O5/c1-11-3-5-17-13(7-11)8-18(22)12(2)16(17)6-4-14(20)9-15(21)10-19(23)24/h8,11-12,14-18,20-23H,3-7,9-10H2,1-2H3
charge 0 multiplicity 1
56 atoms
O  -1.959995 -3.109666 0.939621
O  1.924067 2.499845 2.045113
O  3.989455 1.381655 -1.406709
O  7.383349 -1.337774 -1.172556
O  5.731945 -0.514633 -2.569752
C  -2.719164 0.561405 0.021934
C  -1.355638 -0.043725 0.481857
C  -1.488742 -0.808792 1.832574
C  -3.921704 -0.329979 0.337007
C  -2.707761 0.889234 -1.505655
C  -0.242776 1.038672 0.504133
C  -5.239625 0.473724 -1.717602
C  -5.26136 0.160592 -0.191902
C  -2.528148 -1.948752 1.694321
C  -4.06039 1.438203 -2.012547
C  -3.819762 -1.476113 1.069362
C  -1.832597 0.102526 3.03546
C  1.179987 0.498944 0.770092
C  -5.179358 -0.818015 -2.565868
C  2.223997 1.629169 0.879915
C  3.685027 1.13544 0.97558
C  4.194159 0.441179 -0.298391
C  5.690026 0.058542 -0.163466
C  6.227699 -0.599896 -1.416674
H  -2.87497 1.528427 0.55515
H  -1.064529 -0.803653 -0.280604
H  -0.524619 -1.311213 2.044174
H  -2.442098 -0.031712 -2.063226
H  -1.912639 1.627403 -1.720034
H  -0.480412 1.810947 1.260929
H  -0.224256 1.562387 -0.471717
H  -6.184912 0.998113 -1.968562
H  -6.055265 -0.575453 0.038201
H  -5.525846 1.098539 0.343289
H  -2.720746 -2.385884 2.691471
H  -4.261062 2.41197 -1.518756
H  -3.99897 1.638967 -3.10039
H  -4.710968 -2.096298 1.237008
H  -2.801889 0.615419 2.898656
H  -1.900535 -0.493453 3.96513
H  -1.060117 0.876497 3.193298
H  1.207382 -0.097578 1.706955
H  1.464978 -0.188652 -0.051406
H  -6.072655 -1.445517 -2.388123
H  -5.139879 -0.580735 -3.645423
H  -4.292796 -1.429591 -2.318132
H  2.138143 2.311386 0.018459
H  -2.106983 -2.938908 -0.025699
H  4.319666 2.0188 1.180647
H  3.789187 0.436066 1.832621
H  3.612375 -0.489894 -0.482139
H  1.970931 1.941387 2.864731
H  5.863094 -0.611147 0.697874
H  6.283738 0.977573 0.015142
H  4.33066 0.939656 -2.232738
H  7.719394 -1.727438 -2.026233
