program: Gaussian 09
title: 000195014
version: EM64L-G09RevD.01
frameworkgroup: C1[X(C20H26O3)]
method: RPBEPBE
basis: SDD
operation: Freq
keyword: #pfreq=noraman
keyword: PBEPBE/SDD
title: #p freq=noraman PBEPBE/SDD
converged: NO YES NO NO
title: Mulliken charges:
elementType: O O O C C C C C C C C C C C C C C C C C C C C H H H H H H H H H H H H H H H H H H H H H H H H H H
charge: -0.271075 -0.452178 -0.236455 -0.129206 0.280765 -0.136385 -0.103572 0.170762 0.050517 -0.555694 -0.434320 -0.482966 -0.489302 0.531671 -0.635776 -0.795646 -0.465656 -0.789932 -0.555689 0.209441 -0.581262 0.181071 -0.536744 0.264496 0.259905 0.207547 0.221263 0.231622 0.233776 0.194791 0.241044 0.245208 0.225431 0.219662 0.224273 0.237116 0.226467 0.237884 0.247637 0.208278 0.241908 0.209472 0.257345 0.226495 0.247278 0.230477 0.255985 0.343315 0.288956
chargesum: 0.00000
title: Mulliken charges with hydrogens summed into heavy atoms:
elementType: O O O C C C C C C C C C C C C C C C C C C C C
charge: -0.271075 -0.108862 -0.236455 0.135290 0.280765 0.123519 0.103975 0.170762 0.050517 -0.102809 -0.005753 0.003286 -0.044209 0.531671 -0.174388 -0.083658 -0.015470 -0.096619 -0.077935 0.209441 -0.325276 0.181071 -0.247787
polarizability: 2.90009027e+02 1.03877788e+01 1.99655525e+02 -1.86911758e+01 -1.61507216e+00 1.62600283e+02
1716.lowfreq: -9.4812 0.0005 0.0007 0.0008 4.6355 13.1650 34.0756 52.6807 68.3494
frequency: 33.8188 52.6537 68.3388 85.0793 101.8681 144.0133 153.4558 168.4854 184.7163 187.6747 204.3891 212.1942 228.6182 235.8484 248.9351 264.9046 274.5668 283.0557 287.0953 320.3723 333.2826 360.2263 371.0390 385.8198 396.2917 403.2858 428.0144 432.0429 457.7457 486.0326 496.9945 506.1579 525.7787 552.2612 559.9546 571.5681 596.5280 625.6910 639.3270 647.4098 664.0682 670.6236 724.6827 749.6944 772.8837 787.6013 823.4563 835.6589 841.1045 881.6159 888.3361 907.4519 911.9243 934.9763 938.0698 949.6410 956.5767 965.4495 982.1802 994.1891 1005.1371 1019.2339 1023.5543 1032.9337 1040.3537 1056.1275 1074.1056 1081.4907 1109.2767 1116.1554 1131.2602 1134.3501 1151.4820 1161.1650 1172.1913 1183.8076 1194.2189 1200.1313 1210.4016 1215.8872 1223.9715 1237.3266 1249.9307 1269.9353 1271.1546 1277.1440 1286.5498 1293.2417 1315.7618 1316.9126 1321.0493 1324.4332 1329.7939 1337.5577 1342.8430 1343.2466 1346.5406 1357.8077 1375.5677 1382.3959 1393.0382 1443.7139 1451.0833 1457.1018 1461.7966 1468.1363 1470.4262 1474.3116 1476.5094 1488.9005 1490.2383 1498.4517 1583.4853 1626.6950 2129.8539 2880.6967 2951.1853 2952.9364 2957.3542 2973.4137 2977.4554 2984.4357 2989.1585 2993.1513 2995.3908 3000.8586 3033.8776 3039.6977 3044.0947 3060.0156 3061.1203 3061.5556 3064.1965 3078.4482 3081.4364 3098.1107 3099.3419 3100.9452 3118.3830 3427.4663 3551.8331
redmass: 6.9839 3.9388 4.7463 3.9313 3.1186 4.4615 2.5863 3.2312 4.1950 2.8773 1.2889 2.4995 1.9915 1.8171 2.2046 2.4704 2.7259 1.7389 2.0587 2.9957 2.4305 3.0046 2.8768 2.6085 3.3802 3.3720 4.3901 4.2000 3.3674 3.9772 4.0443 4.2794 2.7167 2.8714 2.9791 4.1775 4.7507 3.3334 1.4035 3.0141 1.2490 3.5753 3.1055 2.6120 2.1634 2.0100 2.1583 2.3741 2.7369 1.5796 2.0896 1.9024 2.6832 2.7588 2.1848 1.8582 1.6688 2.3213 2.4963 2.7684 3.0292 3.3064 2.1708 2.0479 2.2356 2.3300 2.4432 2.1407 2.0067 2.1397 2.7522 1.7809 1.6610 1.8824 1.8401 1.6243 2.0848 2.0364 1.7264 1.7547 1.1838 1.6765 1.4369 1.4955 1.5468 2.0592 1.5032 1.3778 1.5510 1.4853 1.4159 1.3201 1.6322 1.3727 1.4881 1.6615 1.4313 1.3037 1.4355 1.2466 1.2008 1.0785 1.0868 1.0730 1.0826 1.0809 1.0881 1.0601 1.0653 1.0669 1.0637 1.0580 9.9921 7.8402 6.0772 1.0817 1.0679 1.0662 1.0764 1.0626 1.0677 1.0631 1.0406 1.0381 1.0739 1.0627 1.0617 1.0945 1.1000 1.0993 1.0934 1.1010 1.0979 1.0987 1.0984 1.1000 1.1002 1.1029 1.0912 1.1585 1.0663
irintensity: 1.7925 0.2362 3.2769 0.3825 0.7992 1.4554 0.1360 2.8962 3.7265 4.3276 0.3563 0.5881 1.5118 0.5094 3.1760 10.4337 2.4613 71.2930 52.0564 3.6828 15.9440 5.0050 5.8107 14.2823 3.6480 19.4743 1.1187 15.5350 4.2554 1.8522 5.1047 4.3421 0.2425 4.7790 0.6914 2.8350 1.8215 8.2417 52.0868 14.2464 57.7850 11.0721 2.8365 1.7244 4.7247 11.5101 3.3745 3.2070 4.3722 5.0498 41.9878 10.1199 4.6783 31.7104 20.5703 7.2633 9.4616 22.1369 24.1794 70.3801 22.5661 63.2288 6.0374 25.1857 8.8652 8.5532 14.7227 0.6649 2.7349 13.8265 0.9958 5.4407 5.5274 3.1651 5.9076 1.6296 6.6227 18.3519 2.7801 8.8647 4.1818 28.8484 13.9695 29.3060 14.0271 35.0333 2.7486 8.4734 10.8790 9.5803 6.9658 7.2824 11.6206 1.5430 2.8388 4.7837 2.1408 2.3401 2.6620 15.6803 28.9707 17.7194 17.3745 9.7500 2.9046 15.0020 9.9899 10.2441 3.5261 4.7967 9.3814 12.4900 177.7206 170.2346 2.9925 33.1495 33.5085 17.0414 18.7859 23.8542 7.3047 33.4023 8.7953 7.6086 41.4142 43.2142 24.0542 42.3102 35.3095 8.0391 21.4996 34.7779 22.5406 34.6200 24.7242 21.9598 15.0262 16.4024 10.7142 81.5614 9.0549
temp: 298.150 k
press: 1.00000 atm
elementType: 8 8 8 6 6 6 6 6 6 6 6 6 6 6 6 6 6 6 6 6 6 6 6 1 1 1 1 1 1 1 1 1 1 1 1 1 1 1 1 1 1 1 1 1 1 1 1 1 1
symmnumber: 1
zpe: 1086822.0 jmol-1
zpe.correction: 0.413949 hartree
zpe.thermalcorrener: 0.435615 hartree
zpe.thermalcorrenthalpy: 0.436559 hartree
zpe.thermalcorrgfe: 0.365773 hartree
zpe.sumelectzpe: -1001.574446 hartree
zpe.sumelectthermal: -1001.552780 hartree
zpe.sumelectthermalent: -1001.551836 hartree
zpe.sumelectthermalfe: -1001.622622 hartree
dipole: -5.5506 0.4340 2.0390
dipole: 5.9292
quadrupole: -173.6633 -128.6961 -139.0504
quadrupole: 7.6856 6.5038 3.4920
quadrupole: -26.5267 18.4405 8.0862 7.6856 6.5038 3.4920
hfenergy: -1001.9883946 hartree
pointgroup: C01 [X(C20H26O3)]
dipole: 2.1840897 0.1803813 -0.7992138 debye
polarizability: 290.2813037|-9.803179|199.5046498|-18.2678288|0.9503204|162.4788821 unknown
InChI: InChI=1S/C20H26O3/c1-4-20(22)10-8-16-15-6-5-13-11-14(21)7-9-18(13,2)17(15)23-12-19(16,20)3/h1,11,15-17,22H,5-10,12H2,2-3H3
charge 0 multiplicity 1
49 atoms
O  0.12729 -1.483426 -0.191764
O  3.558616 -0.069591 1.991236
O  -6.110289 -0.310662 0.981209
C  1.538948 1.003149 0.194488
C  2.296236 -0.3094 -0.182652
C  0.114958 1.028649 -0.390658
C  -0.614352 -0.244643 0.121795
C  -2.063869 -0.437162 -0.425999
C  3.688635 -0.014872 0.499882
C  2.543661 2.127775 -0.151524
C  1.488138 -1.495908 0.385611
C  3.93925 1.499488 0.175085
C  -0.709434 2.265565 0.028283
C  -2.845562 0.866016 -0.180278
C  -2.154006 2.174377 -0.529735
C  2.476738 -0.501021 -1.709537
C  -2.720567 -1.621088 0.346629
C  -2.031854 -0.745337 -1.956125
C  -4.25125 -1.689674 0.173067
C  4.776978 -0.915405 0.090996
C  -4.134065 0.861355 0.290214
C  -4.921866 -0.365641 0.537252
C  5.684005 -1.698471 -0.197433
H  1.442884 0.990044 1.302356
H  0.168781 0.999379 -1.4974
H  -0.67943 -0.151837 1.234847
H  2.363189 3.04412 0.436599
H  2.475865 2.402824 -1.220863
H  1.903302 -2.477318 0.097012
H  1.420542 -1.424096 1.492396
H  4.646619 1.602395 -0.664627
H  4.404144 1.952733 1.066268
H  -0.227792 3.190046 -0.342271
H  -0.73841 2.336823 1.134887
H  -2.098798 2.260995 -1.636253
H  -2.76349 3.026744 -0.178559
H  2.892479 0.395264 -2.202382
H  3.163838 -1.342667 -1.909605
H  1.507953 -0.741255 -2.17831
H  -2.493328 -1.503706 1.425654
H  -2.247866 -2.564979 0.023576
H  -1.640698 0.103423 -2.544703
H  -1.3839 -1.618856 -2.13928
H  -3.046661 -0.967387 -2.329912
H  -4.694944 -2.490583 0.790567
H  -4.516519 -1.922739 -0.878644
H  -4.664548 1.805779 0.470695
H  3.668952 -1.011334 2.282491
H  6.4814 -2.369788 -0.458181
