program: Gaussian 09
title: 000194960
version: EM64L-G09RevD.01
frameworkgroup: C1[X(C5H5NO3)]
method: RPBEPBE
basis: SDD
operation: Freq
keyword: #pfreq=noraman
keyword: PBEPBE/SDD
title: #p freq=noraman PBEPBE/SDD
converged: YES YES NO NO
title: Mulliken charges:
elementType: O O O N C C C C C H H H H H
charge: -0.288161 -0.231008 -0.144305 0.019508 0.186475 0.242074 -0.496173 -0.565415 0.026059 0.243601 0.247662 0.247577 0.249987 0.262120
chargesum: 0.00000
title: Mulliken charges with hydrogens summed into heavy atoms:
elementType: O O O N C C C C C
charge: -0.288161 -0.231008 -0.144305 0.019508 0.186475 0.242074 0.242666 -0.053308 0.026059
polarizability: 8.07088909e+01 -1.80239447e+01 1.00706551e+02 -3.57897333e-03 -1.45677750e-02 3.30561045e+01
1716.lowfreq: -1.9898 0.0003 0.0008 0.0009 5.3199 10.0458 56.7922 67.8364 83.4366
frequency: 56.7913 67.8212 83.4358 130.6540 160.6946 214.7252 320.1980 362.0198 441.9984 459.6597 496.6567 556.2059 564.6400 705.0429 750.7899 756.5515 851.8472 953.3663 960.9723 1114.8820 1115.9407 1152.0805 1219.0209 1372.8534 1423.8414 1453.3478 1461.5599 1465.2366 1623.7446 1647.6259 2304.1259 3009.4313 3113.4639 3133.5685 3158.6354 3256.5306
redmass: 4.4639 8.1580 1.1671 5.0919 4.4867 4.0677 4.8811 3.5319 4.9618 12.1495 12.1050 11.7003 4.8509 1.6943 6.0268 2.3260 2.6556 5.6329 1.3720 3.2177 1.2673 1.5264 4.7954 1.4787 1.1794 1.0493 1.1820 2.6576 9.5130 6.9247 12.7047 1.0295 1.1049 1.0609 1.1051 1.1176
irintensity: 2.7870 0.9690 0.7721 4.5301 3.5587 1.2989 18.8578 1.5354 4.6104 7.8213 12.2394 25.8768 3.2468 4.2331 25.2373 12.3415 3.6950 12.4762 75.5606 174.8511 0.8582 50.9817 148.1331 28.9247 21.9159 16.1343 7.8075 2.5818 199.7593 1.8134 1046.6534 24.5657 22.4256 4.0639 10.0238 0.3548
temp: 298.150 k
press: 1.00000 atm
elementType: 8 8 8 7 6 6 6 6 6 1 1 1 1 1
symmnumber: 1
zpe: 250737.0 jmol-1
zpe.correction: 0.095501 hartree
zpe.thermalcorrener: 0.104991 hartree
zpe.thermalcorrenthalpy: 0.105935 hartree
zpe.thermalcorrgfe: 0.059850 hartree
zpe.sumelectzpe: -473.264096 hartree
zpe.sumelectthermal: -473.254605 hartree
zpe.sumelectthermalent: -473.253661 hartree
zpe.sumelectthermalfe: -473.299747 hartree
dipole: -1.2503 -0.1198 -0.0018
dipole: 1.2560
quadrupole: -61.0958 -42.7933 -50.8654
quadrupole: 9.1449 0.0049 -0.0034
quadrupole: -9.5110 8.7915 0.7195 9.1449 0.0049 -0.0034
hfenergy: -473.3595967 hartree
pointgroup: C01 [X(C5H5N1O3)]
dipole: -0.4820564 -0.1064022 -0.022133 debye
dipolederiv: -0.6293483 0.2121681 -0.0029571 0.4269458 -1.2606666 -0.0279956 0.0070986 -0.036605 -0.2952309 -0.8911157 -0.2746686 -0.0343384 -0.0094696 -0.6152624 -0.014028 -0.0219531 -0.0239341 -0.3209649 -0.542028 -0.5518895 -0.0362039 -0.5905938 -1.3369777 -0.0715579 -0.0379767 -0.070159 -0.2437156 -0.7301618 -0.5624266 -0.0448427 -0.6012316 -1.6350587 -0.0867772 -0.0467164 -0.085522 -0.211902 0.4225548 0.7112716 0.0445926 0.7100339 0.6182715 0.0505334 0.0444439 0.0508874 0.0849448 1.1388567 -0.0614349 0.0300948 -0.4133953 1.4793715 0.0394815 0.0138151 0.0525531 0.2821196 0.4505233 -0.2728878 -0.0059012 -0.2169402 0.4423795 -0.0010238 -0.0035196 -0.0025085 0.2817585 -0.0635548 -0.0004459 0.0101278 -0.2404572 -0.2743275 -0.0064061 -0.0006326 0.0026871 -0.3336602 0.7738298 0.7199763 0.0489479 0.9389704 2.3481161 0.1260032 0.058883 0.1178686 0.340432 0.0721743 -0.0538241 -0.0048749 0.0071824 -0.0912195 -0.010346 -0.001863 -0.0127102 0.125261 -0.0169793 0.0673524 0.0690903 -0.0171625 0.0507744 0.0784938 0.0845878 0.0299066 -0.0357686 -0.0054474 0.0754679 -0.0596765 -0.0029201 0.0598879 -0.0691276 -0.0829311 -0.01452 -0.0572843 -0.0200532 0.0421815 -0.0062519 0.0530681 0.1052048 -0.0020795 -0.0056929 -0.0024897 0.1960612 0.0407497 -0.0508405 -0.0078066 -0.0440304 0.1095067 -0.0051703 -0.0075429 -0.0054544 0.1879493 unknown
polarizability: 71.9659907|8.6168525|109.2112503|1.8520676|3.7479163|33.2943053 unknown
InChI: InChI=1S/C5H5NO3/c1-4(6-3-7)5(8)9-2/h1H2,2H3
charge 0 multiplicity 1
14 atoms
O  -0.999209 0.928649 -0.002817
O  -2.093278 -1.128391 -0.138136
O  2.318458 2.090523 0.17294
N  1.446134 -0.17756 0.037874
C  0.356696 -1.041945 -0.041629
C  -1.036526 -0.460026 -0.067899
C  -2.31472 1.613901 -0.021198
C  0.509832 -2.395863 -0.096359
C  1.808279 0.990634 0.104187
H  -2.073355 2.683451 0.040672
H  -2.920809 1.288236 0.840398
H  -2.849695 1.376247 -0.955598
H  1.503189 -2.851218 -0.079356
H  -0.376895 -3.030738 -0.157978
