program: Gaussian 09
title: 000195079
version: EM64L-G09RevD.01
frameworkgroup: C1[X(C6H15O15P3)]
method: RPBEPBE
basis: SDD
operation: Freq
keyword: #p
keyword: freq=noraman
keyword: PBEPBE/SDD
title: #p freq=noraman PBEPBE/SDD
converged: NO YES NO NO
title: Mulliken charges:
elementType: P P P O O O O O O O O O O O O O O O C C C C C C H H H H H H H H H H H H H H H
charge: 1.391596 1.357827 1.450813 -0.478885 -0.536233 -0.539679 -0.589485 -0.578688 -0.460223 -0.670071 -0.629079 -0.672839 -0.649545 -0.640732 -0.679509 -0.639688 -0.599850 -0.632698 -0.288455 -0.173858 -0.035524 0.008157 -0.067566 -0.124811 0.299039 0.281951 0.262199 0.281372 0.297974 0.259447 0.428390 0.427440 0.383750 0.452629 0.410766 0.448859 0.401750 0.421431 0.422027
chargesum: 0.00000
title: Mulliken charges with hydrogens summed into heavy atoms:
elementType: P P P O O O O O O O O O O O O O O O C C C C C C
charge: 1.391596 1.357827 1.450813 -0.478885 -0.536233 -0.539679 -0.161095 -0.151248 -0.076473 -0.217442 -0.218313 -0.223979 -0.247795 -0.219302 -0.257482 -0.639688 -0.599850 -0.632698 0.010583 0.108093 0.226675 0.289529 0.230409 0.134636
polarizability: 2.15796583e+02 -4.36371224e-01 2.06646677e+02 -1.16511739e+00 -3.40173772e+00 1.40225864e+02
1716.lowfreq: -7.6763 -3.2093 -0.0024 -0.0022 -0.0020 3.5440 23.7241 27.5603 30.6868
frequency: 23.6806 27.5178 30.6613 40.3213 64.6881 70.2871 75.8024 89.5266 99.6158 114.2498 135.8357 150.8708 163.8108 170.3783 177.3773 191.3512 200.4935 208.9111 219.5005 225.7356 238.3176 250.1774 266.1249 282.8286 289.2297 310.0153 315.1377 316.1606 330.1331 337.2885 341.6460 347.2979 366.1176 373.8322 381.4399 391.0322 399.0344 420.4127 433.3415 446.0407 462.3100 465.2176 478.8185 547.4788 592.0556 614.8983 652.1793 659.5153 675.9519 702.4369 717.8738 738.4250 747.4670 763.1519 779.7785 820.0333 822.5190 848.8764 867.3798 897.4240 908.2613 923.2778 935.5188 940.9143 962.8885 980.8050 1001.3094 1003.9664 1020.0785 1024.1209 1029.5823 1059.8984 1064.5520 1073.6816 1082.7931 1086.5547 1093.4349 1117.5872 1154.3590 1186.5395 1215.9467 1240.4545 1264.1593 1273.4171 1283.6130 1309.5633 1316.5881 1332.7217 1334.3894 1356.3264 1360.9876 1366.2348 1390.1625 1425.6673 1470.6647 1476.9525 2523.1234 2616.7411 2947.1298 2994.7554 3000.1524 3005.2671 3016.6731 3050.8680 3054.9700 3121.4902 3523.4142 3572.4303 3584.5495 3597.7479 3609.0165
redmass: 9.6151 8.2192 8.6401 8.8579 8.1107 9.0809 9.2154 9.8384 8.8149 8.7881 10.0196 2.5135 9.7784 6.7476 5.6778 4.8741 5.9008 2.3144 2.7574 2.8014 4.9567 1.9650 4.0169 2.5517 2.7685 2.4891 4.4196 4.9315 6.0463 3.8776 7.4604 3.0812 7.8888 8.6768 8.7961 10.1146 8.5803 7.0968 5.0056 7.3932 4.3867 5.9338 1.3274 5.0836 5.7833 3.6218 1.9439 6.2697 2.3099 7.3540 6.5465 6.9815 8.5270 7.0200 8.5925 6.4061 8.0309 1.1035 3.8252 2.2139 2.2210 1.2617 3.9293 3.4092 1.9065 3.1591 3.7129 6.5976 3.0091 2.1506 1.4467 1.6388 4.3031 2.7600 2.8825 2.7398 3.1549 2.9238 2.7775 1.3016 1.1753 1.3094 1.1609 1.1616 1.1897 1.3012 1.2270 1.2622 1.3006 1.3075 1.3011 1.3216 1.5734 1.1564 1.1320 1.1613 1.0770 1.0741 1.0822 1.0842 1.0740 1.0829 1.0868 1.0856 1.0857 1.0737 1.0652 1.0662 1.0664 1.0662 1.0668
irintensity: 2.5046 0.6987 1.6192 0.4508 3.3120 15.5708 4.1433 5.7561 3.7092 0.7068 5.2782 92.4102 3.3839 16.0021 3.4877 26.6338 5.6892 48.9265 69.5892 34.7305 33.9966 28.8688 10.3879 43.0941 55.4940 32.5176 97.4505 48.1782 0.6164 18.0355 21.8787 107.7556 12.9030 49.0647 82.2824 19.6071 8.4309 57.7466 0.4724 16.7769 48.0884 42.0829 203.4567 22.8890 66.1218 6.5108 39.0319 36.0454 53.2957 9.5909 116.2990 384.9421 395.3708 160.1302 83.0941 155.9373 177.0545 31.1223 20.9128 85.5015 371.3258 160.2416 208.2306 133.5728 51.8715 73.1728 207.6933 17.3895 57.9674 45.9582 69.6299 143.8632 56.5970 6.9668 197.8035 149.4684 24.7374 35.4694 1.7845 30.6663 2.9977 0.6054 9.3479 5.1427 12.2393 8.3786 8.6216 12.3630 17.8502 110.8603 84.0314 34.9978 9.3883 24.9624 218.4043 178.3070 1685.0071 1890.1523 3.0481 16.9579 706.4818 141.5216 36.7596 4.6298 24.0888 640.1665 36.2637 119.3300 112.2816 91.9516 107.6016
temp: 298.150 k
press: 1.00000 atm
elementType: 15 15 15 8 8 8 8 8 8 8 8 8 8 8 8 8 8 8 6 6 6 6 6 6 1 1 1 1 1 1 1 1 1 1 1 1 1 1 1
symmnumber: 1
zpe: 672638.1 jmol-1
zpe.correction: 0.256194 hartree
zpe.thermalcorrener: 0.283869 hartree
zpe.thermalcorrenthalpy: 0.284813 hartree
zpe.thermalcorrgfe: 0.197655 hartree
zpe.sumelectzpe: -2387.731010 hartree
zpe.sumelectthermal: -2387.703336 hartree
zpe.sumelectthermalent: -2387.702391 hartree
zpe.sumelectthermalfe: -2387.789550 hartree
dipole: -4.2578 -4.7131 -2.8627
dipole: 6.9669
quadrupole: -187.0214 -147.3453 -169.8083
quadrupole: 20.4811 -4.1466 -5.5950
quadrupole: -18.9631 20.7130 -1.7499 20.4811 -4.1466 -5.5950
hfenergy: -2387.9872044 hartree
pointgroup: C01 [X(C6H15O15P3)]
dipole: 1.1048996 2.1558303 1.2824163 debye
polarizability: 207.7024208|-2.9297643|214.6751605|4.0516275|-1.2472446|140.2915421 unknown
InChI: InChI=1S/C6H15O15P3/c7-1-4(19-22(10,11)12)2(8)6(21-24(16,17)18)3(9)5(1)20-23(13,14)15/h1-11,13-14,16-17H
charge 0 multiplicity 1
39 atoms
P  -3.589404 -1.201315 -0.545345
P  2.913805 -3.260968 -0.140707
P  0.279889 4.297113 -0.096229
O  -2.383779 -0.745556 0.642677
O  2.372906 -1.760891 0.636568
O  1.046809 2.796142 0.245181
O  -0.359208 -2.6959 -0.348711
O  -1.880609 1.777899 -0.564546
O  1.520101 0.559888 1.83589
O  -3.814749 0.238409 -1.363721
O  -5.018064 -1.410827 0.344014
O  1.590534 -4.27524 -0.001597
O  3.947505 -3.823906 1.095985
O  0.864726 4.931793 -1.555252
O  1.135195 5.289165 0.987693
O  -3.040497 -2.503217 -1.303813
O  3.596076 -3.010049 -1.552896
O  -1.309041 4.256667 -0.039868
C  -1.115535 -0.395411 -0.056638
C  1.353902 -0.964446 -0.077052
C  0.588244 1.453626 -0.219061
C  -0.059426 -1.425241 0.342315
C  -0.847114 1.089093 0.231158
C  1.625021 0.486636 0.37803
H  -1.237942 -0.478771 -1.160437
H  1.478998 -1.067878 -1.174823
H  0.644004 1.427127 -1.326124
H  -0.086456 -1.587391 1.434495
H  -0.96548 1.301277 1.309378
H  2.636052 0.781403 0.036176
H  -1.315778 -2.771517 -0.677087
H  -1.896523 2.776998 -0.355117
H  2.115715 -0.1499 2.196878
H  -3.105893 0.971444 -1.091437
H  -5.257322 -2.358089 0.516269
H  0.678636 -3.781899 -0.16202
H  4.897621 -3.869325 0.817385
H  1.730851 5.412918 -1.491129
H  1.151627 5.010238 1.937715
