program: Gaussian 09
title: 000195009
version: EM64L-G09RevD.01
frameworkgroup: C1[X(C18H19F2N3O4)]
method: RPBEPBE
basis: SDD
operation: Freq
keyword: #p
keyword: freq=noraman
keyword: PBEPBE/SDD
title: #p freq=noraman PBEPBE/SDD
converged: NO YES NO NO
title: Mulliken charges:
elementType: F F O O O O N N N C C C C C C C C C C C C C C C C C C H H H H H H H H H H H H H H H H H H H
charge: -0.196072 -0.215038 -0.261122 -0.223046 -0.382420 -0.285696 -0.186401 -0.177817 -0.063493 -0.157104 -0.368436 -0.370736 0.139441 0.242182 0.110949 -0.370465 -0.375230 -0.391252 0.230192 0.249104 -0.299749 -0.645713 -0.184424 0.069251 0.088388 -0.613223 0.102864 0.264369 0.229312 0.227618 0.228602 0.224998 0.217919 0.184963 0.198749 0.208245 0.241552 0.242183 0.297117 0.309321 0.237873 0.206808 0.188159 0.226095 0.224027 0.377155
chargesum: 0.00000
title: Mulliken charges with hydrogens summed into heavy atoms:
elementType: F F O O O O N N N C C C C C C C C C C C C C C C C C C
charge: -0.196072 -0.215038 -0.261122 -0.223046 -0.005265 -0.285696 -0.186401 -0.177817 -0.063493 0.107265 0.088494 0.082864 0.139441 0.242182 0.110949 0.032417 0.031764 0.092483 0.230192 0.249104 -0.002632 -0.336392 0.260258 0.069251 0.088388 0.025057 0.102864
polarizability: 3.90778623e+02 -1.13527319e+01 2.39772604e+02 2.64853678e+00 -1.69394104e+01 1.36320119e+02
1716.lowfreq: -13.4482 -5.2806 -0.0009 -0.0005 0.0005 0.4218 15.7276 26.1930 35.2182
frequency: 13.6494 26.0190 35.1851 46.0000 50.6725 70.5263 76.7066 104.8747 117.0809 139.4759 149.7716 166.7828 181.1721 202.6870 219.1571 230.7531 240.5722 258.5248 266.3726 285.2014 301.7447 315.0784 340.1588 341.0579 348.1436 367.9427 384.9528 392.7333 405.3077 419.1680 439.8923 467.3955 468.8537 479.9112 516.6672 531.8847 548.1914 563.6039 596.7337 607.2056 623.5528 636.2198 649.9313 692.1687 702.0616 717.4932 727.0385 745.9749 793.1032 801.6901 825.0588 838.2091 874.7215 910.0809 913.1372 923.4398 945.0906 948.8936 962.6939 968.4984 995.1472 1002.6931 1023.9022 1039.2043 1047.4614 1065.6809 1069.4089 1072.6902 1093.1759 1110.4456 1126.8742 1135.8285 1147.3939 1155.0453 1174.8792 1193.5554 1201.6846 1215.4050 1225.5170 1234.9787 1252.2761 1270.4058 1275.0124 1288.0416 1293.5894 1321.3249 1335.4679 1340.9104 1344.1795 1356.9297 1359.8823 1368.4854 1371.2602 1375.2615 1379.9388 1393.0500 1404.9420 1430.8875 1445.4685 1452.7649 1453.7134 1459.0177 1460.9707 1463.3630 1469.2335 1473.4933 1481.7010 1507.0442 1540.7418 1554.5681 1585.0127 1616.5726 1624.6041 2844.8529 2852.0263 2867.7698 2952.8643 2975.6882 3004.1241 3020.6926 3024.2048 3027.3138 3031.2422 3039.3303 3078.6112 3102.6364 3104.4578 3108.5374 3116.1839 3161.9838 3170.0835 3492.4375
redmass: 4.5362 6.5012 9.4587 6.2086 8.9697 9.1439 3.8431 3.4674 5.0247 7.3287 3.4099 6.4352 3.9540 5.1173 4.7806 1.2664 4.5540 3.2086 9.1109 2.5058 6.7887 2.4818 3.4771 4.5920 4.2810 7.9390 4.1582 5.1522 2.3931 6.2662 4.1968 2.9574 4.7495 5.7237 5.9763 5.6919 3.8011 3.0078 1.9449 3.0594 5.6738 3.4670 3.3691 5.4561 6.6819 5.2803 6.7843 3.5710 6.4215 5.1112 5.0291 1.5908 4.9377 1.4367 2.4118 2.3968 2.8104 1.6667 3.7953 3.3915 2.9614 2.5108 3.1445 4.1863 1.7434 1.7453 2.5103 2.2546 2.2356 2.0879 1.6919 2.0677 2.6437 3.1322 1.9347 1.2566 1.1593 1.8251 2.2934 1.3554 2.2275 1.7241 2.1366 1.5327 1.5021 1.8150 1.5398 1.5675 1.5399 1.5189 1.7443 1.6293 1.6015 2.2308 1.6933 2.7760 5.1974 1.1659 1.1110 1.0964 1.1124 1.0943 1.0660 1.1795 3.5868 1.0989 1.0529 5.6488 9.7888 9.2258 7.9031 8.9323 8.2518 1.0690 1.0646 1.0622 1.0708 1.0674 1.0653 1.0731 1.0580 1.0883 1.0904 1.0853 1.1010 1.0954 1.1061 1.1047 1.0909 1.0933 1.0920 1.0635
irintensity: 0.0015 0.7530 2.7971 0.6680 1.1982 1.7107 1.0717 4.0450 1.2263 1.4533 7.6814 2.6083 3.3292 2.9969 1.1733 0.2526 4.0613 0.4269 2.2980 5.3945 6.3991 11.2483 2.1175 5.0942 10.2994 8.5332 1.4734 1.9357 0.9808 4.7215 5.2897 3.3079 2.2189 1.1589 65.1288 8.8799 16.0930 3.0691 75.5925 72.3785 5.5503 39.4133 1.5863 15.6561 20.4647 5.0962 5.8376 5.8081 27.2344 2.4594 15.2679 1.3374 3.1768 19.9284 14.2706 7.8857 8.8422 8.6615 26.4845 66.6762 24.9254 108.7520 87.2391 180.2384 4.9413 53.6620 147.2937 122.9146 11.4135 25.9162 11.4473 7.1100 32.7142 44.8819 39.8107 33.7145 21.6690 18.4550 7.7739 2.0120 30.6772 8.9055 188.0021 41.9078 119.8788 1.0068 16.9670 2.9241 10.7629 13.7343 81.9936 8.8195 6.1002 17.8019 18.1060 57.2004 3.5702 1.2360 34.7862 47.7156 65.0796 11.6817 28.3845 33.1529 223.9362 13.1262 8.6870 277.4325 119.2308 82.0356 506.9389 125.0307 322.1109 52.5580 54.7481 188.7750 72.3690 62.9833 33.2064 51.0181 23.1702 50.9109 76.3683 12.3991 30.9895 15.7602 4.8622 32.7195 9.2174 4.5427 9.1769 35.6686
temp: 298.150 k
press: 1.00000 atm
elementType: 9 9 8 8 8 8 7 7 7 6 6 6 6 6 6 6 6 6 6 6 6 6 6 6 6 6 6 1 1 1 1 1 1 1 1 1 1 1 1 1 1 1 1 1 1 1
symmnumber: 1
zpe: 926944.4 jmol-1
zpe.correction: 0.353054 hartree
zpe.thermalcorrener: 0.377210 hartree
zpe.thermalcorrenthalpy: 0.378154 hartree
zpe.thermalcorrgfe: 0.297666 hartree
zpe.sumelectzpe: -1360.141078 hartree
zpe.sumelectthermal: -1360.116922 hartree
zpe.sumelectthermalent: -1360.115978 hartree
zpe.sumelectthermalfe: -1360.196467 hartree
dipole: -7.0276 6.7734 -1.6934
dipole: 9.9062
quadrupole: -169.5807 -159.8263 -153.0723
quadrupole: -1.9406 -6.8389 -7.5440
quadrupole: -8.7543 1.0001 7.7542 -1.9406 -6.8389 -7.5440
hfenergy: -1360.4941324 hartree
pointgroup: C01 [X(C18H19F2N3O4)]
dipole: -2.7360561 2.5529322 -1.0891781 debye
polarizability: 390.4512426|-10.7469943|233.0619596|9.0003516|-30.9279723|143.3581442 unknown
InChI: InChI=1S/C18H19F2N3O4/c1-21-2-4-22(5-3-21)15-13(20)6-11-14-17(15)27-9-10(7-19)23(14)8-12(16(11)24)18(25)26/h6,8,10,25H,2-5,7,9H2,1H3
charge 0 multiplicity 1
46 atoms
F  -1.76741 -3.2049 0.591109
F  2.177758 3.468171 1.281125
O  -1.119316 1.437352 -0.725938
O  3.26118 -2.628272 0.736892
O  5.75742 -1.404791 0.579304
O  5.828568 0.758634 -0.235869
N  -2.89388 -0.703672 -0.167436
N  1.709112 1.083718 -0.413254
N  -5.617007 0.216777 -0.015339
C  1.14216 2.432701 -0.654137
C  -3.856606 -1.374537 0.736075
C  -3.544631 -0.076487 -1.339778
C  -1.512638 -0.870925 -0.057578
C  0.819271 -0.000524 -0.189039
C  -0.583288 0.1780 -0.343013
C  -4.941658 -0.366093 1.166871
C  -4.641786 0.905796 -0.893313
C  -0.153021 2.269041 -1.468562
C  1.357171 -1.248775 0.235892
C  -0.909688 -2.102371 0.368397
C  3.063011 0.906444 -0.278456
C  0.456221 -2.30344 0.515733
C  0.887173 3.186748 0.662609
C  2.827973 -1.485788 0.382155
C  3.661861 -0.301139 0.073294
C  -6.757996 1.077407 0.348767
C  5.144851 -0.246924 0.113214
H  1.875314 3.012626 -1.244658
H  -3.330502 -1.751549 1.626194
H  -4.339835 -2.232611 0.226337
H  -4.009636 -0.875642 -1.95645
H  -2.794361 0.44876 -1.946612
H  -5.695342 -0.895143 1.780057
H  -4.469499 0.424918 1.805915
H  -4.157185 1.774814 -0.378546
H  -5.176658 1.286179 -1.784001
H  -0.658724 3.23436 -1.625632
H  0.071137 1.797501 -2.444632
H  3.695798 1.780546 -0.459982
H  0.864375 -3.273519 0.814431
H  0.297224 2.591763 1.379641
H  0.401408 4.160582 0.469064
H  -6.463746 1.976951 0.947204
H  -7.487459 0.496666 0.941174
H  -7.265718 1.428194 -0.567679
H  6.742901 -1.252542 0.562049
