program: Gaussian 09
title: 000195003
version: EM64L-G09RevD.01
frameworkgroup: C1[X(C19H25F3N2O2)]
method: RPBEPBE
basis: SDD
operation: Freq
keyword: #p
keyword: freq=noraman
keyword: PBEPBE/SDD
title: #p freq=noraman PBEPBE/SDD
converged: YES YES NO NO
title: Mulliken charges:
elementType: F F F O O N N C C C C C C C C C C C C C C C C C C C H H H H H H H H H H H H H H H H H H H H H H H H H
charge: -0.151323 -0.135120 -0.151168 -0.417772 -0.231002 -0.004279 -0.003816 -0.388402 -0.386019 -0.367596 -0.383585 -0.388966 -0.385410 -0.571462 -0.368818 -0.163131 0.516235 0.485084 -0.376205 -0.417869 -0.428641 -0.356992 -0.372374 0.293913 -0.487910 0.171003 0.196539 0.196652 0.195540 0.195306 0.195425 0.195391 0.194064 0.194257 0.212464 0.212946 0.196754 0.196721 0.212475 0.211004 0.191515 0.191872 0.218861 0.217111 0.239958 0.239977 0.252029 0.234760 0.252529 0.252056 0.375418
chargesum: 0.00000
title: Mulliken charges with hydrogens summed into heavy atoms:
elementType: F F F O O N N C C C C C C C C C C C C C C C C C C C
charge: -0.151323 -0.135120 -0.151168 -0.042354 -0.231002 -0.004279 -0.003816 0.004788 0.004827 0.023220 0.004735 0.036445 0.008065 -0.147983 0.014569 -0.163131 0.516235 0.485084 0.059767 -0.177910 -0.188664 -0.104964 -0.137614 0.293913 0.016676 0.171003
polarizability: 3.31658374e+02 1.81733056e+01 1.80375835e+02 2.68243287e+01 -3.20840739e+00 1.90408765e+02
1716.lowfreq: -9.6708 -4.2742 -2.4954 -0.0013 0.0005 0.0011 3.6518 4.2830 11.8867
frequency: -2.4691 3.2373 11.8686 17.2031 22.0177 30.0542 34.4622 45.4944 60.2490 73.3567 78.2692 81.6552 98.7263 113.4108 118.4973 126.2004 132.0426 143.6824 151.4485 177.4231 215.4639 218.8596 240.7380 269.3444 293.3178 305.4420 332.4611 351.3189 362.1145 386.0656 399.8488 410.8090 434.7620 443.4414 478.3577 498.6674 502.5452 511.5503 530.3489 561.7990 588.4109 597.6225 634.5967 638.1664 654.9934 720.1748 722.3703 727.1992 730.7145 749.0623 757.8878 784.4981 806.9872 831.7631 842.6185 850.1150 856.6948 889.8587 894.2579 952.4072 958.2665 975.8354 982.6279 986.4936 990.4302 999.5274 1010.8718 1014.3446 1018.8723 1027.4249 1043.2931 1050.0181 1066.9331 1075.3216 1076.6517 1080.1476 1082.0653 1105.7321 1115.5285 1143.5511 1174.2845 1191.7083 1199.7533 1207.8018 1219.7260 1227.1443 1232.5476 1246.7044 1247.7598 1269.4724 1270.8130 1277.5214 1285.3825 1285.9684 1293.5478 1294.8010 1295.9442 1318.0034 1319.0046 1331.0085 1336.3559 1349.4737 1354.4706 1357.6510 1371.4900 1372.3881 1416.0026 1436.5055 1457.9997 1459.8152 1460.2348 1463.5202 1464.4408 1467.8521 1473.7847 1480.3591 1485.9283 1489.0249 1512.8882 1573.0324 1622.2694 1669.1923 2949.2833 2950.5439 2951.9830 2952.6949 2958.6121 2964.4877 2970.4794 2982.2574 2983.5321 2985.7186 2987.7592 2993.8905 2994.9931 3004.7133 3016.9661 3026.2217 3031.4811 3039.7470 3051.3694 3061.3622 3127.0252 3129.9572 3157.0395 3170.7588 3511.2563
redmass: 6.1296 7.3981 7.1079 4.9239 5.0108 1.9654 6.1407 3.3216 9.1709 1.7899 5.9136 2.7326 6.1759 2.1507 2.5781 3.7266 5.0082 2.0208 2.0736 6.3969 7.2967 5.8009 6.0899 6.7686 6.4914 6.7704 4.7967 4.0657 4.4498 9.0802 2.8752 5.9492 5.1311 4.3585 3.9660 1.9822 2.8451 12.5604 5.3300 4.6148 4.7252 5.8435 6.8693 1.3129 8.6278 1.0597 1.0818 4.7830 1.1110 1.1619 4.9375 1.2426 4.1900 1.3063 1.3379 1.7746 4.8458 1.4820 5.0858 1.2932 1.4925 1.4547 4.7571 4.7407 8.2318 6.6501 1.2020 3.5418 3.5705 3.3644 9.1575 3.2711 2.7915 2.3965 1.3253 2.1723 2.2036 3.9018 1.4507 1.3985 5.5792 1.6936 1.2409 1.2702 1.4564 1.3351 1.8822 1.4277 1.3582 1.3089 1.3435 1.0257 1.0609 1.1402 1.1041 1.1182 1.4220 1.8074 2.7722 1.3588 1.4686 1.5582 1.6753 1.6358 1.8337 4.5947 3.2863 1.0844 10.4676 1.0740 1.0761 1.0700 1.0700 1.0899 1.0989 1.1012 1.1018 1.1018 2.5826 6.4943 6.1349 8.2364 1.0588 1.0586 1.0593 1.0594 1.0595 1.0587 1.0589 1.0591 1.0964 1.0617 1.0975 1.0993 1.0603 1.1023 1.1030 1.1026 1.1013 1.1046 1.1047 1.1031 1.0888 1.0895 1.0948 1.0947 1.0639
irintensity: 0.8220 0.7798 0.3170 0.1696 0.0229 0.0352 0.0685 0.0496 0.0645 0.0325 0.5950 0.0624 0.3741 0.2224 0.0608 0.0312 1.5044 0.0525 0.0917 0.9501 1.2906 2.2441 0.1422 0.1390 0.2997 0.0493 1.8512 3.5814 3.8743 1.4128 0.0437 5.2189 7.3267 1.9398 1.3780 26.5446 22.1704 4.2692 6.6529 13.6515 18.6163 13.9707 0.0675 129.2112 5.4237 18.9928 1.5875 5.1242 6.5400 0.5221 6.0773 2.3357 6.9550 1.4465 1.0231 26.4666 1.6619 6.0447 55.3409 0.4287 7.9706 14.1597 1.5297 52.7493 19.7597 212.1621 0.7112 18.3463 70.7424 59.6953 204.7223 36.8214 68.3513 2.3901 5.2715 0.3509 3.3476 9.6445 0.7316 11.5619 162.3749 0.2386 53.7340 4.8254 0.4162 0.4046 1.6320 0.1735 0.0210 5.9724 10.9396 0.1773 0.0023 0.0752 0.3066 0.1115 5.7837 33.3746 21.1871 2.0457 4.8633 8.7427 1.7228 2.4266 30.4178 4.1057 6.6414 28.0054 88.2498 0.0572 0.0945 0.0224 0.3125 0.4838 0.9981 2.2901 3.5507 34.6332 29.8177 1.2906 23.7944 208.7508 0.4319 4.6145 2.5807 2.4047 0.3027 136.3300 37.3338 78.4953 0.1091 5.2607 1.8419 0.8992 40.0913 3.0760 0.5853 2.4369 0.9082 90.3255 118.3031 92.6455 10.1504 16.3224 6.5506 2.6581 18.2672
temp: 298.150 k
press: 1.00000 atm
elementType: 9 9 9 8 8 7 7 6 6 6 6 6 6 6 6 6 6 6 6 6 6 6 6 6 6 6 1 1 1 1 1 1 1 1 1 1 1 1 1 1 1 1 1 1 1 1 1 1 1 1 1
symmnumber: 1
zpe: 1067778.3 jmol-1
zpe.correction: 0.406695 hartree
zpe.thermalcorrener: 0.434011 hartree
zpe.thermalcorrenthalpy: 0.434955 hartree
zpe.thermalcorrgfe: 0.340592 hartree
zpe.sumelectzpe: -1296.451185 hartree
zpe.sumelectthermal: -1296.423870 hartree
zpe.sumelectthermalent: -1296.422926 hartree
zpe.sumelectthermalfe: -1296.517289 hartree
dipole: -3.5565 -0.4695 0.3273
dipole: 3.6023
quadrupole: -204.2501 -159.9272 -152.2440
quadrupole: -21.0273 -5.8279 -5.2845
quadrupole: -32.1097 12.2132 19.8964 -21.0273 -5.8279 -5.2845
hfenergy: -1296.8578807 hartree
pointgroup: C01 [X(C19H25F3N2O2)]
dipole: -1.3963673 0.1504667 -0.1900417 debye
polarizability: 331.9333801|-25.2702274|179.6630578|-19.3637539|-0.4298516|190.8465363 unknown
InChI: InChI=1S/C19H25F3N2O2/c20-19(21,22)18(23-24-18)16-13-11-15(12-14-16)9-7-5-3-1-2-4-6-8-10-17(25)26/h11-14,25H,1-10H2
charge 0 multiplicity 1
51 atoms
F  6.812916 -2.20972 1.258261
F  8.784382 -1.629879 0.294599
F  7.788282 -0.232464 1.779958
O  -12.112974 -1.601588 -0.27706
O  -11.506885 0.616543 0.039323
N  7.156391 -0.997159 -1.843071
N  7.708529 0.132716 -1.541645
C  -2.177789 0.356233 -0.043065
C  -3.606226 0.930788 0.090814
C  -1.071315 1.417152 0.152403
C  -4.710804 -0.132768 -0.100406
C  0.352762 0.837168 0.00703
C  -6.140187 0.4404 0.026198
C  1.46262 1.907994 0.212089
C  -7.242967 -0.62528 -0.162885
C  6.798935 -0.458378 -0.433723
C  2.858709 1.33006 0.060455
C  5.454201 0.145727 -0.241185
C  -8.668296 -0.043298 -0.041263
C  3.521495 0.719239 1.157152
C  3.524912 1.337962 -1.190679
C  4.794935 0.135975 1.018112
C  4.799219 0.758347 -1.346268
C  7.536575 -1.122421 0.70433
C  -9.753322 -1.120417 -0.228493
C  -11.163772 -0.572845 -0.135383
H  -2.063838 -0.112118 -1.043008
H  -2.039512 -0.458072 0.698502
H  -3.720342 1.402196 1.089393
H  -3.746285 1.742348 -0.653582
H  -1.212294 2.235089 -0.584926
H  -1.179756 1.880787 1.15534
H  -4.593121 -0.607318 -1.09722
H  -4.572615 -0.942078 0.646928
H  0.499026 0.018001 0.739763
H  0.469774 0.381092 -0.996722
H  -6.257965 0.916763 1.021796
H  -6.279225 1.247902 -0.722507
H  1.341697 2.352628 1.219386
H  1.307544 2.723613 -0.520833
H  -7.120771 -1.103654 -1.157514
H  -7.104386 -1.430576 0.588941
H  -8.813373 0.757931 -0.790938
H  -8.794883 0.438191 0.947479
H  3.032358 0.705061 2.138559
H  3.04005 1.808388 -2.054351
H  5.266118 -0.31947 1.893649
H  5.281207 0.788474 -2.329029
H  -9.651622 -1.926299 0.524693
H  -9.650735 -1.620677 -1.212037
H  -13.026879 -1.210487 -0.215762
