program: Gaussian 09
title: 000194922
version: EM64L-G09RevD.01
frameworkgroup: C1[X(C11H19N3O2)]
method: RPBEPBE
basis: SDD
operation: Freq
keyword: #p
keyword: freq=noraman
keyword: PBEPBE/SDD
title: #p freq=noraman PBEPBE/SDD
converged: YES YES NO NO
title: Mulliken charges:
elementType: O O N N N C C C C C C C C C C C H H H H H H H H H H H H H H H H H H H
charge: -0.269413 -0.257808 -0.176084 -0.383416 -0.571063 -0.152372 -0.486656 -0.365535 -0.453713 -0.125859 0.192588 0.154237 -0.458677 -0.369188 -0.353888 -0.394025 0.267127 0.218390 0.277558 0.266645 0.225061 0.235424 0.232449 0.243184 0.250975 0.220511 0.327773 0.177533 0.195296 0.225809 0.186916 0.177339 0.207070 0.260705 0.275104
chargesum: 0.00000
title: Mulliken charges with hydrogens summed into heavy atoms:
elementType: O O N N N C C C C C C C C C C C
charge: -0.269413 -0.257808 -0.176084 -0.055643 -0.035254 0.114755 0.009292 0.126171 0.014160 0.117325 0.192588 0.154237 0.012810 0.003640 0.058838 -0.009616
polarizability: 1.82857361e+02 9.13157532e+00 1.34741778e+02 4.90163491e-01 1.65504888e+00 1.04215204e+02
1716.lowfreq: -0.0009 -0.0008 0.0001 2.2315 6.1392 11.0666 31.0316 42.9541 47.7461
frequency: 31.0276 42.9497 47.6100 73.9529 92.8414 116.5425 127.7575 129.0118 143.3714 188.2540 204.3600 236.5411 255.5523 276.7041 331.1545 353.8849 395.6985 438.9279 455.9325 473.8141 490.5170 547.8924 592.3591 606.5475 616.8510 655.0753 659.7343 732.3453 761.5033 780.5340 799.1683 840.9249 865.7337 894.1480 915.3592 918.3915 937.8793 974.7251 994.7566 1025.8379 1032.7310 1058.0351 1082.4690 1088.3587 1093.9833 1106.6446 1121.1929 1150.1517 1164.4239 1169.3084 1177.2051 1215.7129 1229.5582 1234.9080 1258.5163 1263.7041 1273.3771 1280.5101 1288.7585 1294.8311 1302.9723 1307.0101 1313.2698 1332.5478 1333.7474 1352.0022 1358.8797 1380.0080 1388.7855 1407.5020 1459.9456 1464.3646 1469.0832 1476.7494 1478.5217 1492.6380 1492.7413 1610.6631 1638.5740 1639.0185 2856.8120 2913.0603 2944.5831 2947.0257 2962.1129 2985.3263 2990.9330 3002.4282 3008.1021 3020.0297 3024.6887 3046.9233 3072.4315 3080.5689 3086.7959 3100.7111 3456.5223 3530.4095 3584.2941
redmass: 4.4939 4.1317 1.7976 4.1440 2.9477 4.2906 3.0981 2.1388 3.6726 2.7211 4.2298 1.2654 2.5971 2.5521 5.0338 3.8207 4.3027 4.0937 3.5512 6.2838 3.5502 2.0708 1.3397 2.1124 2.6299 2.5391 4.7078 1.2395 1.9260 3.1246 1.5714 3.2910 1.9574 1.7186 1.8950 2.0849 2.4755 2.4174 1.9782 2.8752 2.1106 2.7911 2.1131 1.7749 2.0989 2.4810 2.2873 1.4722 2.9042 1.7600 1.7279 1.3073 1.4049 1.3606 1.2984 1.4397 1.3469 1.2885 1.0879 1.2476 1.3703 1.2559 1.2568 1.5220 1.4585 2.9377 1.6349 2.4962 1.4768 2.7872 1.0814 1.0758 1.0825 1.0930 1.0946 1.0905 1.0867 10.9738 2.3834 1.5823 1.0717 1.0813 1.0604 1.0828 1.0665 1.0678 1.0855 1.0737 1.0857 1.0612 1.0639 1.1004 1.0992 1.0969 1.1015 1.1053 1.0449 1.0768 1.0976
irintensity: 0.8107 1.9812 2.4690 0.9129 1.7638 5.7261 0.9257 0.3046 2.0984 4.0964 6.1379 48.7354 4.3397 4.3128 21.4097 2.7038 5.9901 5.6948 24.4795 1.4545 9.4170 17.0580 198.0503 41.3864 28.3756 41.9199 9.4024 10.8188 2.8568 1.2500 8.6372 7.8201 6.3686 5.6722 12.1215 1.5235 1.3934 0.6912 4.9172 0.7540 0.5684 4.7000 0.4100 1.6482 5.1516 1.9660 36.3571 1.2352 6.6055 11.0595 11.4950 12.6570 0.1326 36.2850 37.5040 6.7467 1.3551 0.6336 0.8035 2.2463 0.8578 17.9546 4.1651 16.2729 5.6346 149.4857 3.9631 107.3722 7.9140 15.3447 1.8178 0.2131 10.6233 25.5384 11.3434 5.9330 5.1603 314.4102 237.4097 148.3703 113.0705 29.0429 35.1331 26.0854 26.7551 41.9312 5.2488 34.1438 33.4692 27.9655 32.9874 58.1413 35.1639 15.1203 11.1250 32.0271 1.2107 26.3153 0.2714
temp: 298.150 k
press: 1.00000 atm
elementType: 8 8 7 7 7 6 6 6 6 6 6 6 6 6 6 6 1 1 1 1 1 1 1 1 1 1 1 1 1 1 1 1 1 1 1
symmnumber: 1
zpe: 783095.4 jmol-1
zpe.correction: 0.298265 hartree
zpe.thermalcorrener: 0.314792 hartree
zpe.thermalcorrenthalpy: 0.315736 hartree
zpe.thermalcorrgfe: 0.252822 hartree
zpe.sumelectzpe: -744.037932 hartree
zpe.sumelectthermal: -744.021406 hartree
zpe.sumelectthermalent: -744.020461 hartree
zpe.sumelectthermalfe: -744.083376 hartree
dipole: -0.3168 1.1335 1.2821
dipole: 1.7404
quadrupole: -77.0772 -119.3950 -92.1163
quadrupole: -15.7602 5.8634 1.8922
quadrupole: 19.1190 -23.1988 4.0799 -15.7602 5.8634 1.8922
hfenergy: -744.3361978 hartree
pointgroup: C01 [X(C11H19N3O2)]
dipole: 0.1360741 0.4829849 -0.4658981 debye
polarizability: 182.7650813|-9.3298081|134.8823312|1.4167637|0.513572|104.1669304 unknown
InChI: InChI=1S/C11H19N3O2/c12-6-2-1-4-8-11(16)14-7-3-5-9(14)10(15)13-8/h8-9,13H,1-7,12H2
charge 0 multiplicity 1
35 atoms
O  -0.63448 -2.478068 -0.058189
O  -1.80586 2.68965 0.666071
N  -2.145309 -0.734718 -0.405316
N  -0.179973 1.081817 0.188855
N  6.584422 -0.07263 0.391561
C  -2.414907 0.702775 -0.691866
C  -3.915603 0.89537 -0.350284
C  -3.383702 -1.473253 -0.066072
C  -4.296606 -0.355426 0.491839
C  0.236996 -0.184127 -0.466581
C  -0.877749 -1.254542 -0.290825
C  -1.456302 1.598593 0.127139
C  1.58304 -0.678542 0.09582
C  2.787098 0.207033 -0.2962
C  4.122958 -0.356062 0.237475
C  5.338039 0.517969 -0.134679
H  -2.223874 0.920842 -1.764416
H  -4.512596 0.934351 -1.278113
H  -4.054218 1.843461 0.194701
H  -3.144416 -2.274408 0.652232
H  -3.817784 -1.941522 -0.97164
H  -4.065688 -0.181985 1.558129
H  -5.366886 -0.606846 0.407516
H  0.356506 -0.009371 -1.561261
H  1.732308 -1.708046 -0.274809
H  1.504452 -0.759354 1.197889
H  0.525823 1.623204 0.694791
H  2.656674 1.243911 0.083161
H  2.837566 0.287543 -1.402238
H  4.293319 -1.375955 -0.156802
H  4.065377 -0.450214 1.343002
H  5.14646 1.56381 0.21588
H  5.42247 0.56449 -1.238007
H  6.601969 -0.162794 1.412609
H  7.444377 0.350244 0.030128
