program: Gaussian 09
title: 000017480
version: EM64L-G09RevD.01
frameworkgroup: C1[X(C20H26N2O)]
method: RPBEPBE
basis: SDD
operation: Freq
keyword: #p
keyword: freq=noraman
keyword: PBEPBE/SDD
title: #p freq=noraman PBEPBE/SDD
converged: YES YES NO NO
title: Mulliken charges:
elementType: O N N C C C C C C C C C C C C C C C C C C C C H H H H H H H H H H H H H H H H H H H H H H H H H H
charge: -0.284373 -0.090800 -0.354005 -0.356828 -0.557954 -0.407540 -0.323993 -0.326409 0.251476 0.515248 0.488601 -0.676782 -0.703780 -0.445105 -0.424991 -0.337027 -0.383468 -0.226165 -0.227964 -0.234490 -0.240607 -0.244893 -0.244361 0.244954 0.199578 0.187144 0.270071 0.222889 0.202390 0.180208 0.203069 0.181283 0.296436 0.211667 0.225176 0.206861 0.261758 0.214378 0.203183 0.218434 0.222672 0.252165 0.282443 0.223019 0.223600 0.224040 0.224722 0.226579 0.227489
chargesum: 0.00000
title: Mulliken charges with hydrogens summed into heavy atoms:
elementType: O N N C C C C C C C C C C C C C C C C C C C C
charge: -0.284373 -0.090800 -0.057568 0.087704 -0.370810 0.085420 0.058605 0.057943 0.251476 0.515248 0.488601 -0.033078 -0.024461 -0.226671 -0.202319 -0.084862 -0.101025 -0.003146 -0.004364 -0.010449 -0.015885 -0.018314 -0.016872
polarizability: 2.44330569e+02 1.34881694e+01 2.29785381e+02 3.99314570e+00 5.09525562e+00 2.14983902e+02
1716.lowfreq: -12.8369 -6.3412 -0.0003 -0.0002 -0.0001 3.2460 10.9580 14.5606 27.4370
frequency: 8.0255 13.4173 27.3156 28.7767 33.3096 34.5652 57.0513 70.0698 73.5103 110.1359 118.5008 136.0236 157.1434 202.7740 228.8413 241.8256 245.6062 265.2877 268.5814 280.5700 285.8383 317.1218 322.1644 386.0818 401.0044 401.6417 404.7090 456.9549 476.9563 491.6774 516.0481 534.3028 558.0054 615.1323 615.3848 636.0872 696.4007 705.3551 707.7475 711.4846 752.1730 755.6587 759.6153 788.3838 798.5254 808.2881 831.6195 842.0845 858.1243 860.4018 894.3385 916.1632 924.4290 937.2193 966.3688 982.1763 987.6223 989.2136 990.5473 991.1453 1002.2687 1022.1235 1027.7258 1030.8183 1052.7433 1069.5192 1073.9301 1078.0505 1082.6008 1088.2414 1091.5127 1125.0446 1169.3616 1171.0045 1172.7767 1180.1276 1188.5676 1192.8097 1193.9690 1204.4019 1209.7921 1237.6305 1252.2530 1284.2295 1289.0414 1297.6217 1310.1060 1323.4807 1333.9629 1343.1387 1354.1124 1363.8555 1380.4604 1382.0029 1384.7975 1386.4686 1395.2456 1440.1506 1441.5708 1443.8570 1464.7407 1466.0807 1471.8487 1475.3996 1478.0809 1478.3484 1483.1838 1483.9493 1491.9975 1502.3991 1590.5899 1593.2229 1604.9920 1607.5520 1613.6435 2838.4378 2847.4943 2954.2373 2978.9392 2983.9041 2988.1046 3008.7937 3020.2026 3029.7636 3034.2778 3075.0788 3077.0865 3084.4222 3090.9629 3099.8423 3109.1276 3112.3469 3124.7730 3125.7367 3137.5887 3139.3539 3149.5825 3156.7373 3162.5074 3172.6815 3558.0216
redmass: 3.5222 4.5111 4.0516 3.8002 3.2310 4.0912 4.4721 2.1223 4.2129 3.1557 2.5055 5.5055 2.1604 4.3249 2.6734 3.6970 1.3017 2.6246 2.4805 3.6329 1.7030 3.6009 4.6682 2.7251 3.9890 2.7969 2.8652 2.5624 3.4615 2.8968 1.5315 2.7030 3.8693 6.4074 6.3544 4.7130 2.3050 2.4567 2.0495 2.2272 2.1921 1.8682 2.1006 1.9173 1.1903 1.2402 3.5677 1.2580 1.2774 3.7810 2.2677 1.7371 1.8135 1.8004 1.3988 1.3930 2.4776 3.5929 3.0975 1.9786 1.3214 3.6334 2.2646 2.4427 3.1201 2.0713 2.4353 1.6333 2.6337 1.6042 1.6774 1.7301 1.4068 1.0809 1.2269 2.0801 1.1527 1.9521 1.1299 2.3081 2.4307 1.6771 1.3937 1.1936 1.1915 1.5786 1.2711 1.2260 1.2602 1.3420 1.2915 1.3321 1.3132 7.0363 6.9814 1.2469 1.2255 2.1383 2.1681 1.1517 1.0855 1.0543 1.0812 1.7091 1.1314 2.0712 1.0668 2.0971 1.0656 1.0622 6.3062 6.1807 5.5038 5.9094 6.1818 1.0718 1.0707 1.0584 1.0356 1.0357 1.0837 1.0986 1.0903 1.0628 1.0869 1.0988 1.0982 1.1008 1.1005 1.1053 1.0874 1.0872 1.0864 1.0867 1.0921 1.0927 1.0953 1.0978 1.1014 1.0970 1.0781
irintensity: 0.9348 0.1353 0.3542 0.4563 0.7892 0.3271 0.5234 0.7307 2.4836 3.6112 2.4318 6.3126 3.0494 4.3717 0.1051 1.3646 0.4984 0.9324 0.6856 0.6478 0.3787 1.1603 12.7408 6.6286 8.5090 0.2048 0.2214 1.2376 5.2845 6.0961 88.3623 39.4663 3.6867 0.9346 0.0745 13.1436 22.5290 48.8609 35.1841 17.4763 21.3359 19.9468 31.7701 2.9902 6.1970 7.7860 1.8672 0.0201 0.8631 0.9706 2.5876 0.1716 1.7352 6.8897 0.0537 0.5278 3.8481 0.2284 0.0312 0.0719 1.4152 4.7723 14.4521 4.2823 10.7806 21.5474 11.5138 0.8415 14.4615 21.6017 31.0554 17.6052 6.4849 0.2351 2.5964 35.8848 2.6943 1.3746 0.5767 86.6303 45.3308 5.4051 5.8790 16.4961 0.6026 48.9193 8.7225 9.8144 2.9455 8.8122 15.2039 2.3506 2.8030 0.6894 1.7069 27.8888 13.9902 0.6158 17.0641 38.5282 22.4387 7.4169 9.5453 182.6362 3.8570 45.3531 21.8766 25.6050 12.2592 12.3803 12.2474 6.3074 51.1288 32.1004 17.2972 36.0764 194.8558 38.2472 27.1286 35.3850 24.4804 6.0328 32.7376 34.7117 42.6499 30.5396 60.6283 30.6624 43.7451 12.0007 10.2816 9.1125 1.3911 1.2217 20.9662 36.1304 13.5560 38.9962 31.9748 5.7165 17.7857
temp: 298.150 k
press: 1.00000 atm
elementType: 8 7 7 6 6 6 6 6 6 6 6 6 6 6 6 6 6 6 6 6 6 6 6 1 1 1 1 1 1 1 1 1 1 1 1 1 1 1 1 1 1 1 1 1 1 1 1 1 1
symmnumber: 1
zpe: 1091071.6 jmol-1
zpe.correction: 0.415567 hartree
zpe.thermalcorrener: 0.438950 hartree
zpe.thermalcorrenthalpy: 0.439894 hartree
zpe.thermalcorrgfe: 0.357298 hartree
zpe.sumelectzpe: -960.737391 hartree
zpe.sumelectthermal: -960.714008 hartree
zpe.sumelectthermalent: -960.713064 hartree
zpe.sumelectthermalfe: -960.795661 hartree
dipole: 0.7022 1.2037 -3.0895
dipole: 3.3892
quadrupole: -133.4927 -135.8102 -125.4327
quadrupole: 4.1860 0.9370 2.6955
quadrupole: -1.9142 -4.2317 6.1458 4.1860 0.9370 2.6955
hfenergy: -961.1529586 hartree
pointgroup: C01 [X(C20H26N2O1)]
dipole: 0.2487961 -0.0587831 1.3086838 debye
polarizability: 246.5916506|-12.7498173|229.0709041|1.1465614|-0.4215907|213.4372972 unknown
InChI: InChI=1S/C20H26N2O/c1-3-22(4-2)16-15-21-20(23)19(17-11-7-5-8-12-17)18-13-9-6-10-14-18/h5-14,19,21H,3-4,15-16H2,1-2H3
charge 0 multiplicity 1
49 atoms
O  0.429148 0.248581 -1.081618
N  4.644213 0.471276 0.160185
N  0.964197 0.923247 1.070619
C  3.295998 0.073308 0.635457
C  -1.316084 0.050398 0.6726
C  2.345042 1.298925 0.70782
C  5.741974 0.167537 1.115418
C  4.930309 0.033536 -1.232018
C  0.090089 0.407936 0.134012
C  -2.399492 0.836241 -0.086264
C  -1.565627 -1.469764 0.658429
C  6.989876 1.050079 0.912885
C  3.996633 0.672491 -2.278082
C  -3.173493 1.802801 0.602623
C  -2.332171 -2.039687 1.707477
C  -2.643724 0.616937 -1.465747
C  -1.09046 -2.315004 -0.376686
C  -4.177251 2.538011 -0.068742
C  -2.622361 -3.421706 1.725655
C  -3.643178 1.353281 -2.13784
C  -1.377356 -3.698756 -0.356199
C  -4.415225 2.314482 -1.443475
C  -2.144613 -4.258568 0.690816
H  2.836686 -0.678332 -0.039126
H  3.361565 -0.395651 1.637941
H  -1.370987 0.376223 1.730028
H  2.322455 1.786569 -0.280234
H  2.725392 2.029253 1.443378
H  5.352884 0.349147 2.135097
H  6.040816 -0.91223 1.075049
H  5.972221 0.316127 -1.468111
H  4.871571 -1.082981 -1.318419
H  0.661314 1.009429 2.041379
H  7.477845 0.866696 -0.061027
H  6.710132 2.11725 0.959523
H  7.736681 0.842781 1.702074
H  2.936899 0.408862 -2.109545
H  4.088694 1.773291 -2.251982
H  4.272887 0.324136 -3.290905
H  -2.992653 1.982026 1.670498
H  -2.713405 -1.395406 2.510226
H  -2.041466 -0.115818 -2.010408
H  -0.486944 -1.886727 -1.183912
H  -4.76924 3.280481 0.478501
H  -3.217656 -3.84351 2.543549
H  -3.820393 1.177619 -3.204987
H  -1.000746 -4.340209 -1.161246
H  -5.192279 2.88218 -1.967788
H  -2.366817 -5.331587 0.701823
