program: Gaussian 09
title: 000194925
version: EM64L-G09RevD.01
frameworkgroup: C1[X(C11H10O6S2)]
method: RPBEPBE
basis: SDD
operation: Freq
keyword: #p
keyword: freq=noraman
keyword: PBEPBE/SDD
title: #p freq=noraman PBEPBE/SDD
converged: YES YES NO NO
title: Mulliken charges:
elementType: S S O O O O O O C C C C C C C C C C C H H H H H H H H H H
charge: 0.239664 0.994419 -0.238683 -0.243925 -0.567177 -0.503755 -0.502389 -0.143372 -0.788101 0.293216 -0.181225 -0.054997 0.225989 -0.118256 -0.207284 -0.261329 -0.222331 -0.749740 0.214262 0.279166 0.302822 0.254236 0.259454 0.285969 0.287779 0.265049 0.260108 0.236649 0.383781
chargesum: 0.00000
title: Mulliken charges with hydrogens summed into heavy atoms:
elementType: S S O O O O O O C C C C C C C C C C C
charge: 0.239664 0.994419 -0.238683 -0.243925 -0.183395 -0.503755 -0.502389 -0.143372 -0.206113 0.293216 -0.181225 -0.054997 0.225989 0.135980 0.052170 0.024640 0.065448 0.012066 0.214262
polarizability: 3.16787590e+02 -1.73788319e+00 1.37950277e+02 -4.28476905e+00 -8.95161244e+00 1.40406028e+02
1716.lowfreq: -5.4804 -1.0478 0.0009 0.0013 0.0026 3.5921 8.4253 18.9437 35.6396
frequency: 7.2249 18.8729 35.6300 41.4818 62.1094 70.9511 92.0139 126.4873 130.0646 156.1518 168.9755 176.2307 200.4296 234.5216 248.5468 266.5566 283.7357 300.5181 306.9017 351.7048 357.2849 383.8572 401.1606 406.9954 484.9663 497.5840 527.9383 558.2152 573.7318 599.0897 614.3880 638.3528 665.2567 693.1922 699.8753 714.1117 765.8061 817.2624 825.1677 832.3527 835.1383 854.2479 882.0608 953.8089 961.8039 965.9494 976.7960 984.7878 1046.3231 1046.8330 1053.4780 1056.3338 1070.3747 1121.9537 1180.5703 1193.5563 1221.3821 1239.0933 1297.1866 1299.8775 1367.0580 1398.2165 1411.2017 1440.3095 1449.7598 1458.2629 1467.2562 1575.0776 1581.7435 1706.9846 1782.7556 2994.5182 3032.0313 3076.5624 3109.9047 3111.9080 3149.0315 3156.4785 3170.3010 3175.3275 3479.2999
redmass: 8.2999 6.7767 4.8307 8.3001 4.7657 8.9636 8.3359 4.4128 1.1835 7.5104 6.1414 1.7009 5.5237 6.2945 3.0009 3.3085 7.6165 4.7814 4.0134 8.8209 7.8948 6.2483 10.9633 2.9491 5.3909 4.9391 5.4326 10.2882 7.0486 5.7633 6.9788 6.5907 11.7582 7.2838 5.7960 4.7648 9.8936 2.1884 2.2919 3.9708 1.7447 4.8692 2.2954 2.2478 1.3495 11.1588 1.4194 5.7220 1.4484 1.2985 1.8896 3.6741 2.1733 1.3571 2.4100 1.1744 1.7399 1.3272 1.7613 2.2271 4.5530 4.1402 1.2986 1.1628 1.0459 1.9303 1.0592 5.9656 7.4573 8.9845 12.6267 1.0372 1.0568 1.0987 1.1016 1.1054 1.0890 1.0885 1.0968 1.0966 1.0661
irintensity: 1.9067 3.8600 0.9777 0.7715 2.4950 2.6165 0.6397 0.7188 0.0143 2.3507 3.7671 48.6476 2.2916 4.8436 4.9391 31.6016 13.2920 36.0517 7.0142 2.8582 13.4011 0.2016 84.6719 3.0976 3.5129 27.1128 2.2653 209.4753 1.1719 3.8470 2.7971 37.3289 16.6378 35.0132 6.8869 14.1223 1.8055 97.2159 2.9344 102.9451 23.6072 54.7230 27.0201 46.0336 3.9076 90.0445 2.1499 9.5088 4.6645 48.6378 61.1898 173.6972 18.8606 5.1268 129.7449 2.2320 57.7508 7.0948 4.6701 5.5596 11.3621 13.1844 21.9910 29.9343 13.0886 36.8147 17.9433 129.8276 2.8402 50.4181 720.1543 9.1668 6.7714 5.7033 9.4076 4.6235 1.2869 3.3275 1.2917 9.7434 45.5405
temp: 298.150 k
press: 1.00000 atm
elementType: 16 16 8 8 8 8 8 8 6 6 6 6 6 6 6 6 6 6 6 1 1 1 1 1 1 1 1 1 1
symmnumber: 1
zpe: 506446.5 jmol-1
zpe.correction: 0.192895 hartree
zpe.thermalcorrener: 0.212735 hartree
zpe.thermalcorrenthalpy: 0.213679 hartree
zpe.thermalcorrgfe: 0.140271 hartree
zpe.sumelectzpe: -1671.037180 hartree
zpe.sumelectthermal: -1671.017340 hartree
zpe.sumelectthermalent: -1671.016396 hartree
zpe.sumelectthermalfe: -1671.089804 hartree
dipole: -1.6141 3.4083 -0.2072
dipole: 3.7768
quadrupole: -172.6477 -128.4806 -121.5502
quadrupole: -37.1120 -4.3721 -2.5388
quadrupole: -31.7548 12.4123 19.3426 -37.1120 -4.3721 -2.5388
hfenergy: -1671.2300749 hartree
pointgroup: C01 [X(C11H10O6S2)]
dipole: -0.6116524 1.2655238 0.4819859 debye
polarizability: 316.796772|-4.2602884|145.3856075|-0.7665311|-6.6378079|132.9615155 unknown
InChI: InChI=1S/C11H10O6S2/c1-7-10(17-11(12)16-7)6-18-8-2-4-9(5-3-8)19(13,14)15/h2-5,13H,6H2,1H3
charge 0 multiplicity 1
29 atoms
S  -1.020228 -0.569385 0.738509
S  5.345535 0.123023 -0.182818
O  -3.88023 -0.602286 -1.245686
O  -5.566707 0.50914 -0.166164
O  5.50403 -1.125204 -1.552727
O  5.685469 1.587669 -0.782073
O  6.129663 -0.441148 1.115588
O  -6.113235 -1.330864 -1.562242
C  -1.847329 0.633538 -0.507403
C  -3.316222 0.467609 -0.467724
C  0.75681 -0.316545 0.400236
C  3.506231 -0.067086 0.039895
C  -4.322571 1.125723 0.17927
C  1.267042 0.647471 -0.506378
C  1.649428 -1.15197 1.127394
C  2.659269 0.774455 -0.695812
C  3.040268 -1.032379 0.94996
C  -4.378402 2.278672 1.118589
C  -5.289957 -0.577038 -1.059057
H  -1.564764 1.66074 -0.227834
H  -1.459254 0.389332 -1.509608
H  0.604697 1.306269 -1.073602
H  1.257773 -1.898199 1.82646
H  3.072683 1.518432 -1.383953
H  3.740132 -1.660152 1.509792
H  -4.829462 1.977096 2.080888
H  -4.993639 3.096775 0.703021
H  -3.366392 2.665847 1.319457
H  6.472561 -1.177433 -1.802978
