program: Gaussian 09
title: 000194910
version: EM64L-G09RevD.01
frameworkgroup: C1[X(C3H5O5PS)]
method: RPBEPBE
basis: SDD
operation: Freq
keyword: #p
keyword: freq=noraman
keyword: PBEPBE/SDD
title: #p freq=noraman PBEPBE/SDD
converged: YES YES NO NO
title: Mulliken charges:
elementType: S P O O O O O C C C H H H H H
charge: 0.043364 1.111383 -0.700504 -0.669065 -0.551125 -0.408070 -0.309565 -0.116321 0.293731 -0.461120 0.256047 0.266894 0.435476 0.412043 0.396834
chargesum: 0.00000
title: Mulliken charges with hydrogens summed into heavy atoms:
elementType: S P O O O O O C C C
charge: 0.043364 1.111383 -0.265029 -0.257022 -0.551125 -0.011236 -0.309565 -0.116321 0.293731 0.061820
polarizability: 1.25133149e+02 -1.61261154e+01 9.20799754e+01 -9.29952207e+00 1.40886986e+00 6.69328003e+01
1716.lowfreq: -12.4736 -9.3114 -0.0026 -0.0018 -0.0016 8.0458 31.3925 58.7961 81.1582
frequency: 31.2889 58.7912 81.1540 131.6666 139.3629 195.0075 215.8653 262.1485 273.0152 294.6655 320.3453 340.8345 360.4684 422.5433 430.3409 548.8154 596.7421 627.2431 656.3065 673.8412 685.4570 749.0411 771.0478 849.5355 989.3443 1003.2075 1040.0031 1093.1407 1145.5805 1166.4404 1322.0676 1407.0732 1581.7516 1624.1855 3115.5052 3232.4774 3358.0270 3527.0805 3561.7941
redmass: 7.7404 5.9675 8.7282 10.3429 8.8265 9.1250 6.5039 2.6884 3.9944 3.6168 2.7868 3.8544 4.8083 10.0211 6.6009 6.8226 1.1838 1.9351 2.2148 1.1970 6.4848 15.4889 3.1651 2.6936 1.6376 1.3589 2.4358 3.0057 1.2533 1.7102 2.4905 1.3358 5.3316 7.3275 1.0610 1.1167 1.0652 1.0644 1.0657
irintensity: 3.2757 4.7141 3.4198 8.7713 5.8284 5.0323 13.4704 41.2679 18.5996 15.6475 43.0904 3.4142 48.3286 82.1728 26.4436 12.3963 121.2515 36.9314 45.2654 245.2104 120.5927 137.4385 30.3972 2.6329 95.6889 59.8353 310.5488 54.7998 278.7605 52.0583 25.1316 46.4725 102.2892 134.6078 1.3158 0.1463 247.4670 59.1158 107.0867
temp: 298.150 k
press: 1.00000 atm
elementType: 16 15 8 8 8 8 8 6 6 6 1 1 1 1 1
symmnumber: 1
zpe: 232573.2 jmol-1
zpe.correction: 0.088582 hartree
zpe.thermalcorrener: 0.100672 hartree
zpe.thermalcorrenthalpy: 0.101616 hartree
zpe.thermalcorrgfe: 0.049455 hartree
zpe.sumelectzpe: -1231.925959 hartree
zpe.sumelectthermal: -1231.913870 hartree
zpe.sumelectthermalent: -1231.912926 hartree
zpe.sumelectthermalfe: -1231.965087 hartree
dipole: -4.0910 -0.6915 -2.0228
dipole: 4.6158
quadrupole: -61.2057 -68.7908 -80.1556
quadrupole: 0.4114 -8.0893 1.1998
quadrupole: 8.8450 1.2599 -10.1049 0.4114 -8.0893 1.1998
hfenergy: -1232.0145419 hartree
pointgroup: C01 [X(C3H5O5P1S1)]
dipole: -1.6504996 -0.2964413 -0.6970227 debye
dipolederiv: -0.531718 0.1590482 0.0068161 0.2191384 -0.2280162 -0.0304889 -0.0765228 0.0102842 -0.1939522 2.3659376 -0.2362968 -0.0475036 -0.3250328 1.5520465 -0.0131571 0.1206195 0.076857 1.4732844 -0.7978847 0.0257467 0.0084104 0.0729913 -0.9762985 -0.1199322 -0.0247323 -0.2650956 -0.7618348 -1.2369789 -0.0600039 0.1258744 -0.0865922 -0.4459656 0.1775283 0.2955067 0.1857645 -0.5922838 -0.6747905 0.0447128 -0.0436581 0.1679553 -0.5676615 0.0453567 -0.185535 0.0679515 -0.6381883 -1.1202778 -0.4281238 0.112102 -0.4845689 -0.4714097 0.1204751 0.1797841 0.1544281 -0.4224753 -0.9055111 -0.006649 0.1920846 0.2083453 -0.7451563 -0.2628512 0.2261936 -0.1489782 -0.4618759 0.4175813 0.1943006 -0.1871912 0.1970295 -0.507028 -0.1275498 -0.2747247 -0.1704307 -0.078098 1.3217859 0.2859691 -0.2778618 0.1857099 1.3186143 0.3193443 -0.2789379 0.1510986 0.4698755 -0.2892709 -0.0075403 -0.0283509 0.0081898 0.0870325 0.0638099 0.035275 0.123308 -0.129689 0.1281308 -0.0512665 0.0067517 -0.0573367 0.0160982 -0.0290854 -0.0021755 -0.0063299 0.1349484 0.042774 -0.0638317 0.0625062 -0.0241621 0.1140117 -0.014612 0.071239 -0.0074101 0.1703853 0.5322603 0.043601 -0.0020569 -0.11916 0.4197902 0.0390742 -0.0593864 0.0089571 0.3748497 0.3893985 0.0050634 0.0236664 -0.0182436 0.2396832 -0.1055176 -0.0539267 -0.1079466 0.282151 0.3585635 0.0952702 0.0484106 0.0557368 0.1942593 -0.0623944 0.0273234 -0.072458 0.3729031 unknown
polarizability: 125.1178298|-11.4697791|89.091834|-16.2101644|4.6100149|69.9362605 unknown
InChI: InChI=1S/C3H3O2S.H2O3P/c1-2(6)3(4)5;1-4(2)3/h4H,1H2;1-2H
charge 0 multiplicity 1
15 atoms
S  0.277963 1.894382 -0.720073
P  1.953712 0.475888 0.116201
O  2.043093 -0.823703 -1.000917
O  3.370061 1.300998 -0.386298
O  1.813979 0.152367 1.659177
O  -2.687138 -0.729175 0.274084
O  -0.63914 -1.119987 -0.707428
C  -1.177177 1.134153 0.094704
C  -1.43933 -0.310774 -0.164649
C  -2.022869 1.898571 0.840071
H  -1.789279 2.944261 1.06152
H  -2.955739 1.476079 1.228001
H  1.14132 -1.252538 -1.1175
H  3.84306 0.836636 -1.126643
H  -2.787015 -1.705957 0.11215
