program: Gaussian 09
title: 000194920
version: EM64L-G09RevD.01
frameworkgroup: C1[X(C11H22NO4S)]
method: RPBEPBE
basis: SDD
operation: Freq
keyword: #p
keyword: freq=noraman
keyword: PBEPBE/SDD
title: #p freq=noraman PBEPBE/SDD
converged: YES YES NO NO
title: Mulliken charges:
elementType: S O O O O N C C C C C C C C C C C H H H H H H H H H H H H H H H H H H H H H H
charge: 0.199971 -0.318011 -0.465373 -0.179750 -0.205592 -0.098610 -0.417136 0.031147 -0.585617 -0.550501 -0.555998 -0.527399 0.206344 0.269451 -0.472437 -0.690079 -0.829999 0.277644 0.306717 0.279017 0.282013 0.264169 0.286734 0.273160 0.267183 0.272541 0.258591 0.262581 0.301269 0.272722 0.308448 0.273632 0.258237 0.282488 0.266257 0.406849 0.248632 0.273744 0.266962
chargesum: 1.00000
title: Mulliken charges with hydrogens summed into heavy atoms:
elementType: S O O O O N C C C C C C C C C C C
charge: 0.199971 -0.318011 -0.058524 -0.179750 -0.205592 -0.098610 0.167225 0.310164 0.247299 0.262383 0.266442 0.053771 0.206344 0.269451 0.059432 -0.141334 -0.040662
polarizability: 1.92858344e+02 5.52887793e-01 1.51938620e+02 9.28344066e+00 -3.50279786e+00 1.22260795e+02
1716.lowfreq: -20.7684 -7.6864 -2.4867 -0.0022 -0.0011 0.0006 6.3467 7.9663 23.1483
frequency: -18.6259 5.4188 23.1075 29.1982 36.7636 52.7504 64.4985 74.3135 89.3405 108.5772 140.1490 164.2905 189.2656 210.1886 212.7807 227.6254 250.2636 266.4934 276.3450 295.4984 303.1806 327.1233 353.8432 383.5114 427.5968 443.6223 453.3616 468.2417 515.2608 550.7263 567.6518 571.4785 637.7954 664.2528 673.5912 723.5317 731.9957 747.3015 808.7181 809.6535 855.4116 889.6723 907.4771 922.2344 940.7150 942.5300 963.5563 1007.0826 1018.6834 1033.1257 1051.8702 1060.9560 1068.9202 1083.7401 1109.8842 1114.0088 1126.3424 1161.7238 1184.3601 1215.4551 1233.5189 1244.8137 1254.6364 1273.4013 1281.5791 1284.7645 1312.9017 1320.9746 1342.5612 1349.0425 1352.1679 1383.9511 1424.1162 1427.3084 1429.9075 1435.3772 1442.2431 1443.8006 1451.2842 1452.2282 1458.1752 1463.6019 1469.3303 1472.2104 1480.2013 1491.0361 1501.4043 1658.5340 1696.2582 2991.3163 3005.3147 3015.7323 3023.5911 3026.7926 3029.1184 3033.3839 3035.2000 3059.2254 3065.5500 3075.0815 3110.2941 3112.2501 3119.5814 3135.8003 3139.7216 3142.5013 3145.0198 3146.7902 3151.5312 3165.2510 3506.1160
redmass: 2.9691 3.2949 4.9444 8.3226 7.5433 5.4954 2.7705 4.0805 3.0100 2.1678 1.4267 2.9043 2.2196 3.3259 1.2769 5.0977 1.8542 1.8308 2.0838 3.3625 1.2417 4.7021 2.3812 2.5908 2.1082 4.0693 2.4521 3.5494 2.3490 3.0105 3.6958 3.8780 5.8982 6.0141 1.4058 3.3619 3.8122 1.5405 3.6443 5.0420 2.5809 5.3581 2.8190 2.8892 1.4002 2.8329 1.1847 2.0156 1.9653 3.6720 1.2001 2.4798 2.5890 2.2114 1.9259 1.4305 1.7165 1.2197 1.2687 1.5536 1.6843 1.2459 1.8691 1.1212 1.4373 1.7656 1.3686 1.4413 1.2240 1.1363 1.3884 1.3335 1.1496 1.1379 1.0753 1.0772 1.0965 1.0878 1.0498 1.0583 1.0513 1.1063 1.0495 1.0683 1.0580 1.0523 1.0533 10.2113 9.4928 1.0652 1.0295 1.0620 1.0321 1.0321 1.0366 1.0566 1.0585 1.0858 1.0948 1.0976 1.1064 1.1067 1.1056 1.1025 1.1056 1.1057 1.1056 1.1053 1.1058 1.1050 1.0642
irintensity: 0.9323 3.7215 2.4680 1.7700 2.6052 0.9425 0.9030 1.1535 0.7767 0.4926 0.0287 3.1957 2.7730 4.6299 1.3129 13.8458 1.1359 1.8948 4.8765 5.7005 0.0805 5.2137 0.7431 0.9004 0.3130 3.5428 3.0697 3.6718 21.5704 7.4123 20.0001 31.5594 11.7955 8.9929 131.9152 14.5671 6.9186 33.6092 3.7160 22.9287 8.8803 81.4686 74.8383 31.3004 2.5043 23.7389 3.7878 19.8682 50.3271 112.7706 0.8707 166.6155 186.0635 147.4227 14.6227 1.9697 0.6901 23.5604 3.7004 2.0617 1.3999 27.3651 0.5388 1.5341 7.4220 14.1123 20.4545 75.1816 9.4997 1.3499 0.4779 6.5824 11.7826 19.2962 5.0859 14.5349 5.5642 27.7064 1.1888 21.6703 23.2146 9.3807 2.4918 12.9341 37.4604 41.1937 72.1076 143.8279 294.8194 10.2919 22.0416 3.7107 1.6575 4.2385 5.1430 8.2590 11.3772 4.6615 4.3450 2.5256 8.6102 1.4355 21.6027 5.6667 1.1311 0.7094 2.8811 9.0697 2.3012 1.1727 53.2726
temp: 298.150 k
press: 1.00000 atm
elementType: 16 8 8 8 8 7 6 6 6 6 6 6 6 6 6 6 6 1 1 1 1 1 1 1 1 1 1 1 1 1 1 1 1 1 1 1 1 1 1
symmnumber: 1
zpe: 858940.0 jmol-1
zpe.correction: 0.327153 hartree
zpe.thermalcorrener: 0.347806 hartree
zpe.thermalcorrenthalpy: 0.348750 hartree
zpe.thermalcorrgfe: 0.273388 hartree
zpe.sumelectzpe: -1184.451096 hartree
zpe.sumelectthermal: -1184.430443 hartree
zpe.sumelectthermalent: -1184.429499 hartree
zpe.sumelectthermalfe: -1184.504861 hartree
dipole: 9.8158 -7.9506 -1.1512
dipole: 12.6841
quadrupole: -60.5400 -90.7189 -103.4867
quadrupole: -32.3512 7.8311 0.1522
quadrupole: 24.3752 -5.8037 -18.5715 -32.3512 7.8311 0.1522
hfenergy: -1184.7782491 hartree
pointgroup: C01 [X(C11H22N1O4S1)]
dipole: -4.2093006 -2.6309545 0.5129062 debye
polarizability: 192.7784112|-6.0160888|152.4155233|6.0368507|4.1730768|121.8638251 unknown
InChI: InChI=1S/C11H22NO4S/c1-12(2,3)8-9(7-10(13)14)16-11(15)5-6-17-4/h9,13H,5-8H2,1-4H3
charge 1 multiplicity 1
39 atoms
S  5.361089 -1.401436 -0.447903
O  0.352785 -0.193092 0.417663
O  -3.051427 2.093425 -0.576239
O  -2.326063 3.92302 0.666846
O  1.270541 0.953741 -1.398757
N  -2.293528 -1.814569 0.024963
C  -2.047798 -0.4436 0.709483
C  -0.959254 0.44499 0.099678
C  -2.361923 -1.667462 -1.495012
C  -3.639849 -2.341563 0.52928
C  -1.202663 -2.822819 0.398374
C  -0.994235 1.858709 0.723034
C  -2.157293 2.74933 0.304183
C  1.44963 0.206827 -0.417175
C  2.746667 -0.397039 0.070657
C  3.764978 -0.619384 -1.069922
C  6.186831 0.113569 0.311728
H  -1.816205 -0.663261 1.766112
H  -3.002552 0.101942 0.642021
H  -1.051568 0.547516 -0.994917
H  -1.356105 -1.471089 -1.892552
H  -2.745785 -2.607783 -1.919518
H  -3.035453 -0.83416 -1.746802
H  -3.636366 -2.339176 1.629956
H  -3.783645 -3.368278 0.159552
H  -4.445709 -1.691903 0.155349
H  -1.371668 -3.750235 -0.170454
H  -1.264583 -3.02756 1.478241
H  -0.223148 -2.386346 0.164982
H  -0.97429 1.814369 1.828031
H  -0.076265 2.395102 0.421528
H  3.173826 0.299504 0.820606
H  2.546198 -1.3380 0.611905
H  4.002576 0.325963 -1.584105
H  3.374649 -1.326494 -1.821023
H  -3.754279 2.737361 -0.867123
H  5.639214 0.472165 1.197919
H  7.192929 -0.212292 0.617057
H  6.275443 0.911105 -0.442646
