program: Gaussian 09
title: 000194899
version: EM64L-G09RevD.01
frameworkgroup: C1[X(C9H5N3O5)]
method: RPBEPBE
basis: SDD
operation: Freq
keyword: #pfreq=noraman
keyword: PBEPBE/SDD
title: #p freq=noraman PBEPBE/SDD
converged: YES YES NO NO
title: Mulliken charges:
elementType: O O O O O N N N C C C C C C C C C H H H H H
charge: -0.305417 -0.204292 -0.200104 -0.167141 -0.167083 0.025367 0.067278 0.039351 0.404150 0.383752 -0.373776 -0.278790 -0.326191 -0.344916 0.212400 0.059727 -0.290219 0.261159 0.313468 0.294251 0.293328 0.303701
chargesum: 0.00000
title: Mulliken charges with hydrogens summed into heavy atoms:
elementType: O O O O O N N N C C C C C C C C C
charge: -0.305417 -0.204292 -0.200104 -0.167141 -0.167083 0.025367 0.067278 0.039351 0.404150 0.383752 -0.112617 0.034678 -0.031940 -0.051588 0.212400 0.059727 0.013482
polarizability: 2.68189599e+02 1.26605304e+01 1.51563006e+02 3.32064356e-02 -1.00216953e-01 5.09863624e+01
1716.lowfreq: -6.8630 -2.6617 -1.2969 -0.0005 -0.0002 0.0003 14.0707 31.2754 46.2953
frequency: 13.4684 31.2593 46.2879 62.2264 67.7781 100.2443 131.5145 146.6752 170.2214 222.3081 299.3597 309.5278 351.1379 380.9923 414.0393 427.1898 451.6793 455.4799 501.0764 508.3887 542.0599 617.7496 627.0536 632.7747 662.7464 731.8479 745.4768 761.8823 765.4375 806.6721 840.4259 870.8175 873.4262 985.5708 999.8322 1001.4622 1015.6389 1082.9421 1093.7338 1111.8131 1148.8817 1168.7223 1189.1268 1220.6665 1290.8375 1361.0204 1365.5043 1402.0456 1422.5849 1468.6787 1571.6528 1591.1922 1607.3841 1657.9058 2060.9230 3170.5348 3182.5001 3191.6292 3215.8628 3221.8626
redmass: 6.6115 10.0458 11.9111 11.1355 7.2584 6.8392 11.5031 9.1808 10.6699 10.8924 7.5275 7.4938 11.3108 9.8841 3.0021 9.0412 8.5814 13.3962 3.5765 7.2758 4.1434 7.2937 9.1957 1.5731 4.6563 4.8740 10.3446 10.3528 7.9278 7.9567 1.2842 7.7462 1.5438 1.3368 3.1087 1.3366 6.1761 9.3550 3.0943 1.2878 2.2872 1.6581 1.8203 6.5960 1.2729 3.2599 8.0842 11.2197 3.9437 2.3552 11.9284 7.2817 7.2437 12.6354 13.1732 1.0897 1.0915 1.0969 1.0954 1.0903
irintensity: 2.7877 5.1926 1.2081 2.1503 0.0537 0.5505 2.7585 4.0150 2.5004 1.6870 1.6610 0.1731 4.0669 0.0878 0.0006 0.8275 6.5088 2.1631 6.5273 1.8869 0.0688 2.7591 4.4653 62.9666 27.0971 7.4409 12.3146 65.1438 5.8632 7.9408 7.5982 122.1955 85.2284 0.6629 6.2649 0.0253 376.0487 278.6211 52.9954 34.2959 223.9754 32.5474 22.6362 330.9797 1.5041 272.7252 63.1410 14.2730 54.4516 66.4940 219.3194 65.0442 53.7785 185.6393 422.3325 1.5691 2.0759 3.8279 4.6423 16.4461
temp: 298.150 k
press: 1.00000 atm
elementType: 8 8 8 8 8 7 7 7 6 6 6 6 6 6 6 6 6 1 1 1 1 1
symmnumber: 1
zpe: 355109.9 jmol-1
zpe.correction: 0.135254 hartree
zpe.thermalcorrener: 0.150340 hartree
zpe.thermalcorrenthalpy: 0.151284 hartree
zpe.thermalcorrgfe: 0.089400 hartree
zpe.sumelectzpe: -884.986900 hartree
zpe.sumelectthermal: -884.971815 hartree
zpe.sumelectthermalent: -884.970871 hartree
zpe.sumelectthermalfe: -885.032755 hartree
dipole: -2.3779 -3.9981 0.0189
dipole: 4.6518
quadrupole: -139.3024 -96.4311 -94.8783
quadrupole: 16.0653 -0.0161 -0.0430
quadrupole: -29.0984 13.7728 15.3257 16.0653 -0.0161 -0.0430
hfenergy: -885.1221546 hartree
pointgroup: C01 [X(C9H5N3O5)]
dipole: 0.9904267 1.2523656 -0.8945238 debye
dipolederiv: -2.3977776 0.2997647 -0.3146435 0.6959371 -0.4903561 0.268301 -0.6085609 0.2508552 -0.3852597 -0.7542333 0.1514253 -0.1361356 0.1987138 -0.5266076 0.2331174 -0.1720405 0.2311984 -0.4089863 -0.8405311 -0.1549282 0.0904018 -0.2009536 -0.478833 0.182856 0.1240927 0.1844179 -0.3581066 -0.5911391 -0.2113096 0.1477906 0.3712219 -0.6537106 0.3076869 -0.291161 0.2839008 -0.4936742 -0.4858947 0.3981704 -0.3062056 -0.1361962 -0.6237803 0.2417165 0.0956843 0.2600956 -0.4864997 2.0402691 -0.0427104 0.1104129 -0.0342244 0.7669894 -0.4313193 0.1056048 -0.4312578 0.5251168 1.8107368 0.8717263 -0.595509 0.2726418 0.1426104 0.0361996 -0.1492089 0.0562647 0.130963 -1.0374492 -0.5508155 0.3770476 -0.1566828 -0.1115375 0.0508067 0.0838467 0.0378301 -0.0617248 1.6197352 -0.1482398 0.1728123 -0.0138581 0.1897193 -0.0487559 0.0716139 -0.0536267 0.1682902 -0.8427529 0.0605972 -0.0830979 0.04932 0.0167281 0.0276009 -0.0753854 0.0279639 0.0259251 -0.4242908 0.1445152 -0.119089 0.2343351 -0.0883897 -0.0402392 -0.1868987 -0.044032 -0.1303372 -0.5396914 -0.0735264 0.0384831 -0.1602145 -0.09357 -0.0353583 0.1024194 -0.0320281 -0.1035025 0.2628133 -0.0846631 0.0786477 0.1353275 -0.0406434 -0.0343516 -0.0866556 -0.0437883 -0.0651173 0.2304096 0.0606423 -0.0316751 -0.1560039 -0.0181981 -0.0628269 0.1313279 -0.0537983 -0.0473475 1.6313059 0.038397 0.0230911 -1.1132908 0.9960841 -0.5958764 0.8882185 -0.5480614 0.7168999 0.7719943 -0.2117751 0.1795932 0.5961993 0.9716919 -0.5448105 -0.4288828 -0.5737943 0.6301401 -1.0595217 -0.5364867 0.3743493 -0.5787996 -0.5292973 0.1604723 0.4074459 0.1627353 -0.3952219 0.038164 -0.0625431 0.0411629 -0.0730579 0.0796207 0.0640159 0.0494232 0.0644762 0.1230382 0.1596272 0.031273 -0.0246256 0.0221543 0.120679 0.046514 -0.0175897 0.0471176 0.1458425 0.1067649 0.0397602 -0.0325915 0.0089044 0.1034032 0.0527443 -0.0094132 0.0542099 0.1324548 0.0901483 -0.0410836 0.0272716 -0.0166763 0.1120138 0.0435751 0.0087784 0.0426959 0.1397119 0.2113132 0.0218101 -0.0174912 0.0552026 0.1553835 0.0779315 -0.0426588 0.0766255 0.1973951 unknown
polarizability: 268.7238079|10.9301452|115.1001612|0.4593092|-47.7656172|86.9149984 unknown
InChI: InChI=1S/C9H5N3O5/c10-11-5-8(13)9(14)17-7-3-1-6(2-4-7)12(15)16/h1-5H
charge 0 multiplicity 1
22 atoms
O  1.022494 -0.058902 0.068754
O  -5.134513 1.080323 -1.050679
O  -5.354717 -0.740002 0.308485
O  1.464872 -1.903655 1.475892
O  4.229921 -1.310608 1.122445
N  -4.644133 0.13575 -0.319047
N  4.868039 0.909827 -0.520453
N  6.00772 1.154636 -0.665639
C  -0.401004 -0.104651 0.043945
C  -3.168316 0.053342 -0.193182
C  -0.975207 0.919518 -0.747018
C  -1.201131 -1.057472 0.723067
C  -2.371125 1.003722 -0.870173
C  -2.601826 -0.968808 0.596371
C  1.855616 -0.958926 0.777476
C  3.348362 -0.60215 0.561287
C  3.606096 0.552702 -0.295576
H  -0.320227 1.633507 -1.253551
H  -0.747676 -1.841182 1.329427
H  -2.849666 1.779934 -1.472089
H  -3.257497 -1.682276 1.102227
H  2.816717 1.138871 -0.761773
