program: Gaussian 09
title: 000194894
version: EM64L-G09RevD.01
frameworkgroup: C1[X(C12H14N2)]
method: RPBEPBE
basis: SDD
operation: Freq
keyword: #pfreq=noraman
keyword: PBEPBE/SDD
title: #p freq=noraman PBEPBE/SDD
converged: YES YES NO YES
title: Mulliken charges:
elementType: N N C C C C C C C C C C C C H H H H H H H H H H H H H H
charge: -0.412128 -0.577381 -0.168802 -0.498186 0.438531 -0.176057 -0.572793 0.415910 -0.442059 0.243838 -0.451834 -0.474555 -0.371725 -0.201824 0.209758 0.221231 0.198780 0.217146 0.221530 0.224435 0.190804 0.270533 0.298434 0.227844 0.223163 0.212136 0.275775 0.257495
chargesum: 0.00000
title: Mulliken charges with hydrogens summed into heavy atoms:
elementType: N N C C C C C C C C C C C C
charge: -0.113694 -0.044111 0.040956 -0.078175 0.438531 -0.176057 -0.134117 0.415910 -0.026819 0.243838 -0.181302 -0.246711 -0.148562 0.010312
polarizability: 1.73002516e+02 6.40294060e+00 1.55780594e+02 1.22070201e+01 5.33574656e+00 8.31378898e+01
1716.lowfreq: -11.8465 -8.1086 -0.0006 -0.0005 -0.0003 8.1221 58.3230 97.0074 132.5472
frequency: 58.3045 96.9958 132.5344 169.7816 199.4546 207.3777 228.4916 307.1739 342.7105 403.8281 433.3432 456.4584 494.7981 495.5867 515.0118 523.7806 549.1984 581.5093 623.5389 639.5776 654.1838 707.0352 754.3979 781.3916 796.8509 814.9302 857.1841 873.9186 888.3827 914.2578 944.6080 948.7061 1012.6403 1023.3034 1037.1679 1060.7467 1089.0382 1101.0936 1107.3761 1126.6140 1161.6975 1174.7765 1205.9468 1218.0790 1236.2448 1264.8136 1279.7887 1294.6805 1321.1025 1330.7470 1341.6948 1352.1986 1365.9444 1405.1560 1416.3630 1452.4406 1457.7877 1463.8812 1473.4565 1500.9087 1563.6153 1615.9924 1626.6190 1639.0077 2871.7765 2959.4737 2964.2390 2986.0636 3024.9088 3037.4706 3041.4473 3115.1087 3130.4415 3152.1801 3233.7770 3476.1768 3606.2816 3613.0835
redmass: 3.8859 3.2318 2.4611 1.1576 2.9080 3.9829 3.0079 2.7811 3.3072 3.1163 2.9716 3.8508 1.6581 2.3769 3.9562 2.9922 1.4065 3.2146 5.2233 2.8631 3.1497 3.4730 1.3696 4.4349 1.4444 3.3093 2.7193 1.4691 2.1279 2.1354 1.8073 1.3224 2.5034 1.9205 2.0338 2.5854 2.3558 2.4136 2.4193 1.4566 1.2622 1.2527 1.4112 1.7321 1.5252 1.3043 1.7742 1.3145 2.4207 1.3697 1.6243 1.5227 1.3974 2.8188 3.2307 2.4803 1.4140 1.1108 1.0935 3.4050 6.7044 7.4445 7.6027 1.0974 1.0709 1.0656 1.0791 1.0652 1.0936 1.0902 1.1028 1.0861 1.0909 1.0983 1.0984 1.0450 1.0985 1.0807
irintensity: 0.5339 5.4045 3.7043 27.6751 3.0144 12.6135 0.2074 6.4644 0.9828 1.3620 15.8079 10.9248 58.8457 31.5603 6.7652 18.6972 158.7207 3.4658 1.3315 0.9051 1.2933 0.9737 92.4164 8.5097 13.8557 6.6209 2.1343 0.5772 5.3091 3.6250 4.1941 2.8280 11.7475 3.1108 11.3286 11.8503 18.3128 16.5157 10.3962 14.2511 0.4682 4.2824 3.0451 4.3484 1.4545 12.1473 0.8364 2.4080 3.4769 3.0519 20.6242 4.6091 12.8113 17.9879 9.1269 7.2731 25.0130 17.6420 1.8292 2.1440 3.6871 7.3353 4.6259 42.6865 112.4097 31.6373 19.4353 72.8301 43.3607 45.2236 47.7841 5.3266 22.7392 39.9371 0.8957 0.4064 1.7380 51.6766
temp: 298.150 k
press: 1.00000 atm
elementType: 7 7 6 6 6 6 6 6 6 6 6 6 6 6 1 1 1 1 1 1 1 1 1 1 1 1 1 1
symmnumber: 1
zpe: 618042.6 jmol-1
zpe.correction: 0.235400 hartree
zpe.thermalcorrener: 0.247192 hartree
zpe.thermalcorrenthalpy: 0.248137 hartree
zpe.thermalcorrgfe: 0.198056 hartree
zpe.sumelectzpe: -574.171295 hartree
zpe.sumelectthermal: -574.159503 hartree
zpe.sumelectthermalent: -574.158559 hartree
zpe.sumelectthermalfe: -574.208639 hartree
dipole: 1.9289 1.1857 -0.3228
dipole: 2.2871
quadrupole: -71.8274 -70.9583 -84.8948
quadrupole: -3.0850 -0.3142 0.8835
quadrupole: 4.0661 4.9352 -9.0013 -3.0850 -0.3142 0.8835
hfenergy: -574.4066952 hartree
pointgroup: C01 [X(C12H14N2)]
dipole: -0.7596503 -0.4622096 -0.1377719 debye
polarizability: 173.274908|6.4707853|155.8067224|-11.3427529|-4.6359062|82.8393693 unknown
InChI: InChI=1S/C12H14N2/c13-6-9-5-4-8-2-1-3-11-12(8)10(9)7-14-11/h1-3,7,9,14H,4-6,13H2
charge 0 multiplicity 1
28 atoms
N  0.67132 -2.336267 0.259156
N  -3.616181 -0.840571 -0.91628
C  -1.978465 0.354626 0.553554
C  -1.416721 1.767754 0.932074
C  -0.817389 -0.60606 0.42558
C  0.496023 -0.088084 0.132858
C  -0.250271 2.2788 0.029152
C  0.878375 1.258716 -0.05574
C  -2.840737 0.400299 -0.745945
C  1.419862 -1.171776 0.03447
C  -0.682149 -1.989879 0.493352
C  2.238092 1.505174 -0.328754
C  2.78474 -0.927653 -0.247583
C  3.16957 0.422555 -0.4208
H  -2.657766 0.036324 1.371914
H  -1.048666 1.722951 1.975704
H  -2.243655 2.505087 0.909539
H  0.119915 3.246975 0.417675
H  -0.638019 2.483314 -0.991087
H  -2.171771 0.50857 -1.619354
H  -3.477822 1.318037 -0.704946
H  -1.431874 -2.757943 0.668516
H  1.036342 -3.285715 0.259539
H  2.595797 2.53157 -0.47677
H  3.522033 -1.734042 -0.330059
H  4.220893 0.647983 -0.635588
H  -3.857366 -1.081801 -1.879653
H  -4.406909 -0.940546 -0.273923
