program: Gaussian 09
title: 000194974
version: EM64L-G09RevD.01
frameworkgroup: C1[X(C16H28N2O2S2)]
method: RPBEPBE
basis: SDD
operation: Freq
keyword: #p
keyword: freq=noraman
keyword: PBEPBE/SDD
title: #p freq=noraman PBEPBE/SDD
converged: YES YES NO NO
title: Mulliken charges:
elementType: S S O O N N C C C C C C C C C C C C C C C C H H H H H H H H H H H H H H H H H H H H H H H H H H H H
charge: 0.030059 0.001140 -0.354687 -0.300464 -0.370444 -0.411875 -0.444281 -0.443460 -0.350539 -0.348582 -0.325873 -0.345486 -0.680534 -0.644071 -0.072704 -0.092950 -0.681372 -0.685654 -0.382086 -0.395705 0.328008 0.214531 0.207971 0.205702 0.199565 0.208014 0.215401 0.205393 0.204489 0.208060 0.246944 0.223837 0.225805 0.258797 0.272049 0.324647 0.267270 0.306204 0.259626 0.259392 0.210510 0.223263 0.212249 0.210112 0.218557 0.210120 0.312233 0.375909 0.219965 0.264947
chargesum: 0.00000
title: Mulliken charges with hydrogens summed into heavy atoms:
elementType: S S O O N N C C C C C C C C C C C C C C C C
charge: 0.030059 0.001140 -0.354687 -0.300464 -0.058211 -0.035966 -0.030608 -0.035882 0.070255 0.063967 0.144909 0.139116 -0.083839 -0.070597 0.186923 0.166441 -0.035351 -0.046865 -0.162121 -0.130758 0.328008 0.214531
polarizability: 2.94126539e+02 -4.45618689e-02 2.13665279e+02 -2.49672438e+01 -1.33275233e+01 2.19154198e+02
1716.lowfreq: -6.5240 -0.0008 0.0013 0.0017 2.0501 7.4684 11.6149 16.4856 24.2786
frequency: 11.1109 16.1275 24.1993 25.6450 41.0060 50.8365 54.8866 60.6482 71.0770 75.9895 81.7104 88.6746 102.7942 107.4226 118.9321 142.1267 155.8362 165.8376 173.9118 201.0705 225.6545 231.1003 238.5746 245.3376 250.9636 267.7977 268.2733 285.8490 294.5647 321.2924 340.0007 403.4968 418.5874 419.9221 458.0862 466.7910 497.9711 503.8196 541.9374 591.5462 601.9945 682.9741 685.7354 695.4905 708.8743 741.0119 743.4684 776.8910 810.2153 811.7669 834.6846 838.3851 870.7965 872.1198 897.0363 904.4907 922.1822 928.9571 946.4725 962.5367 986.4431 997.7152 1011.1263 1013.1673 1031.6733 1035.5097 1058.9612 1060.0580 1090.5617 1093.3217 1095.0459 1097.0860 1138.3454 1141.2839 1164.7261 1190.6227 1205.9449 1208.9116 1230.7679 1233.2197 1238.1245 1247.2254 1259.5664 1260.4485 1282.4795 1282.6273 1291.8325 1294.3881 1300.5611 1309.4283 1327.9889 1330.7416 1345.4927 1349.3459 1357.3918 1364.2998 1388.2286 1390.1460 1422.6847 1426.4043 1436.0170 1437.5292 1458.3971 1459.0461 1473.5867 1473.6837 1476.3631 1478.1407 1485.4958 1485.8868 1500.1253 1520.2069 1571.1538 1596.6004 1668.2771 1672.3125 2951.6507 2958.5670 2972.5992 2975.8097 2980.1523 2982.4776 2991.5731 2997.1176 3013.2241 3018.0473 3022.9781 3024.5620 3037.4815 3041.9865 3054.9143 3070.9268 3071.1721 3073.3823 3074.2431 3078.2186 3088.1200 3090.8066 3102.3731 3110.7552 3114.0917 3118.2839 3349.4837 3561.9644
redmass: 4.2735 4.4176 4.5970 4.1838 4.1442 2.9141 2.1625 2.9754 2.7441 3.8110 3.9608 4.6986 4.2580 4.3740 5.8759 4.1208 3.1009 3.9584 3.6274 2.5153 1.2556 1.3644 2.9369 2.6439 3.5354 3.6629 3.3123 2.5349 2.8482 2.8512 2.5069 7.0132 3.4048 3.7971 3.0041 3.5462 2.2725 3.0802 1.4398 4.5321 4.5163 3.6499 3.8973 3.5782 3.5067 1.1442 1.1631 1.1640 2.0395 1.8450 1.7805 1.5519 1.7765 1.9901 1.6714 1.6551 2.1463 2.3699 2.5139 2.6935 1.1571 1.3921 1.6756 1.6624 2.2053 2.1749 2.3515 2.4639 1.9902 2.0293 2.5285 2.6885 2.1783 2.3547 1.2920 1.2088 1.4866 1.5165 1.3950 1.3927 1.4257 1.2938 1.3186 1.3324 1.1302 1.1408 1.3360 1.3308 1.1243 1.1619 1.4828 1.5213 1.5333 1.5516 1.2759 1.3377 1.2145 1.2086 1.0902 1.0855 1.1143 1.1491 1.0914 1.0948 1.0593 1.0578 1.0430 1.0428 1.0777 1.0768 1.9803 1.8578 5.4390 3.9844 6.3042 6.0198 1.0622 1.0612 1.0355 1.0355 1.0606 1.0607 1.0589 1.0616 1.0961 1.0966 1.0631 1.0603 1.1018 1.1019 1.1030 1.1011 1.1011 1.0993 1.1012 1.0993 1.0913 1.0926 1.0892 1.0914 1.1048 1.1003 1.0840 1.0781
irintensity: 0.0806 0.4660 0.2052 0.0688 4.0124 1.2708 0.7372 0.3988 1.3771 1.7987 1.9038 1.6661 1.4306 2.2583 13.0161 0.2611 3.4881 6.8228 7.6686 0.8777 0.6036 0.1015 3.7881 1.0146 6.3421 0.9430 1.2246 3.5534 3.1689 1.6244 6.8522 1.8374 11.2502 6.7606 0.5990 1.9306 23.7722 4.0983 119.1676 0.5806 2.5172 10.1027 24.0009 1.2444 1.4115 10.5993 8.0185 121.9434 8.7448 2.9323 16.4677 11.7506 8.7346 7.6004 3.9156 8.1417 2.3354 7.7409 0.5220 10.1220 51.7367 63.8135 41.8482 4.1780 8.5774 4.4949 7.8412 11.0566 12.7233 8.8120 2.8819 3.9925 6.8507 2.7851 7.3804 3.7731 25.4582 26.7580 18.8723 13.3213 65.4124 9.5826 17.3296 39.4645 6.3397 3.4432 1.6471 5.6833 20.6177 5.8147 24.2418 56.7924 17.2620 45.2393 9.9783 6.9526 12.5640 10.0972 25.2179 14.5878 32.8148 16.4405 3.2345 3.1706 3.0093 5.1341 11.6916 13.2614 14.8633 14.4132 211.3041 224.7637 216.4645 114.2525 92.8463 89.0494 22.2806 19.9749 49.8803 47.7450 32.0062 31.6218 29.9441 29.9269 5.2320 6.1506 17.1172 26.4866 16.6905 14.4978 9.3566 78.7126 11.1518 47.2053 70.1232 41.0588 12.2756 3.6666 23.9322 6.5768 7.5013 1.9147 421.8355 31.3146
temp: 298.150 k
press: 1.00000 atm
elementType: 16 16 8 8 7 7 6 6 6 6 6 6 6 6 6 6 6 6 6 6 6 6 1 1 1 1 1 1 1 1 1 1 1 1 1 1 1 1 1 1 1 1 1 1 1 1 1 1 1 1
symmnumber: 1
zpe: 1100272.4 jmol-1
zpe.correction: 0.419072 hartree
zpe.thermalcorrener: 0.446823 hartree
zpe.thermalcorrenthalpy: 0.447767 hartree
zpe.thermalcorrgfe: 0.355508 hartree
zpe.sumelectzpe: -1680.839375 hartree
zpe.sumelectthermal: -1680.811624 hartree
zpe.sumelectthermalent: -1680.810680 hartree
zpe.sumelectthermalfe: -1680.902939 hartree
dipole: -3.4680 -1.3271 -4.5045
dipole: 5.8377
quadrupole: -133.1227 -154.3459 -148.4164
quadrupole: 3.4150 -9.7627 -5.2392
quadrupole: 12.1723 -9.0509 -3.1214 3.4150 -9.7627 -5.2392
hfenergy: -1681.2584471 hartree
pointgroup: C01[X(C16H28N2O2S2)]
dipole: 0.0773565 -2.2947419 0.0561646 debye
polarizability: 218.0582659|13.34476|217.2177451|-2.5466177|-28.4633745|291.6700057 unknown
InChI: InChI=1S/C16H28N2O2S2/c1-3-5-7-9-15(19)17-11-13-21-22-14-12-18-16(20)10-8-6-4-2/h7-10,17-18H,3-6,11-14H2,1-2H3
charge 0 multiplicity 1
50 atoms
S  -3.503379 0.01388 -0.540742
S  -2.633968 0.004485 1.562829
O  0.732393 -1.257436 -0.152229
O  0.476487 3.686145 0.032352
N  -1.23043 -2.400865 -0.629061
N  0.2983 1.478411 0.769278
C  1.304661 -3.751019 3.438584
C  2.87126 2.289154 -3.410837
C  1.426721 -2.866444 4.712948
C  2.247854 2.741552 -4.76141
C  -1.509061 -1.634106 -1.852769
C  -0.46812 1.849528 1.958299
C  -1.954941 -0.17719 -1.617117
C  -2.000145 1.792569 1.772847
C  1.081042 -2.934891 2.192316
C  2.055759 2.7270 -2.219509
C  1.737621 -3.700288 5.973794
C  3.122765 2.353424 -5.972323
C  0.006384 -3.029516 1.362395
C  1.529946 1.902049 -1.27379
C  -0.122472 -2.162777 0.159136
C  0.736296 2.446539 -0.128703
H  0.489733 -4.488003 3.574884
H  2.248111 -4.327683 3.331614
H  3.888402 2.731471 -3.339843
H  2.999895 1.189202 -3.408877
H  0.48314 -2.30478 4.854037
H  2.2231 -2.111569 4.557402
H  2.099642 3.839742 -4.742733
H  1.240718 2.292015 -4.862707
H  -0.585055 -1.606833 -2.462525
H  -2.281668 -2.180561 -2.421338
H  -0.165547 1.20658 2.805317
H  -0.206189 2.897205 2.203466
H  -2.233668 0.288649 -2.580653
H  -1.155634 0.423355 -1.158752
H  -2.518067 2.197281 2.66053
H  -2.315345 2.358897 0.882331
H  1.848983 -2.189025 1.93303
H  1.864175 3.805816 -2.105123
H  2.695698 -4.242736 5.865466
H  1.812433 -3.057205 6.869255
H  0.945787 -4.449561 6.161415
H  3.268864 1.257872 -6.022749
H  2.660308 2.677075 -6.922729
H  4.122843 2.822159 -5.905461
H  -1.94378 -3.048371 -0.291551
H  0.524538 0.487396 0.586516
H  -0.794211 -3.753916 1.56791
H  1.679016 0.814227 -1.317224
