program: Gaussian 09
title: 000194876
version: EM64L-G09RevD.01
frameworkgroup: C1[X(C11H16ClN)]
method: RPBEPBE
basis: SDD
operation: Freq
keyword: #p
keyword: freq=noraman
keyword: PBEPBE/SDD
title: #p freq=noraman PBEPBE/SDD
converged: YES YES NO NO
title: Mulliken charges:
elementType: Cl N C C C C C C C C C C C H H H H H H H H H H H H H H H H
charge: -0.076354 -0.277123 -0.369450 -0.571173 -0.345203 -0.337712 0.493011 -0.578668 -0.407718 -0.414621 -0.228436 -0.226518 -0.243081 0.199244 0.223312 0.196746 0.231202 0.208363 0.176016 0.242499 0.208600 0.243266 0.255783 0.258440 0.229585 0.234357 0.223764 0.224286 0.227584
chargesum: 0.00000
title: Mulliken charges with hydrogens summed into heavy atoms:
elementType: Cl N C C C C C C C C C C C
charge: -0.076354 -0.034624 0.053106 -0.143225 0.039176 0.114153 0.493011 -0.064445 -0.178133 -0.180265 -0.004671 -0.002232 -0.015497
polarizability: 1.89267380e+02 8.35380935e-01 1.18046700e+02 -2.13402770e+01 3.77704830e-01 9.09809841e+01
1716.lowfreq: -23.9403 -3.7971 -0.0001 0.0004 0.0020 2.1250 17.2777 22.7081 39.8230
frequency: 15.9915 20.9223 39.7895 58.7682 84.5925 91.7654 129.6169 142.1189 192.6956 206.1728 293.6886 336.3561 397.5543 403.6341 435.0559 513.7164 584.9030 617.8786 656.8344 691.6325 705.3935 760.2915 770.6393 795.0118 814.3513 853.3838 854.4592 917.2647 975.7266 989.9382 993.4157 1000.9389 1011.6868 1023.5561 1028.4623 1051.4644 1064.5299 1082.9085 1096.2382 1133.4544 1145.1789 1171.8964 1186.7295 1207.0652 1216.0983 1245.2079 1258.8720 1273.3013 1279.3807 1285.6827 1317.6374 1326.1275 1344.9260 1382.1938 1387.3144 1439.5683 1451.0720 1460.5320 1473.1098 1476.8906 1484.2101 1489.1680 1500.4206 1592.9190 1614.8906 2843.5578 2864.7089 2976.1237 2990.0746 3002.1929 3006.9212 3048.6922 3053.8156 3071.6165 3113.2738 3115.9324 3130.5658 3131.1738 3142.9908 3161.6767 3420.6273
redmass: 3.0097 4.9581 5.7624 2.1930 2.5903 5.7412 2.2270 2.3574 6.2149 4.5245 4.4406 2.3807 4.5786 2.8223 3.5446 3.1477 4.4498 6.3489 1.7538 2.9466 1.7385 1.9071 1.0776 1.1601 3.7182 1.2304 1.2314 1.4466 1.3874 6.2119 1.3239 2.0481 3.7598 2.2111 2.1218 1.4770 2.8560 2.2549 1.6599 1.1534 4.0445 1.0523 1.1161 1.4682 2.2900 1.2298 1.2607 1.1518 1.1473 1.2822 1.3188 1.2601 1.3813 8.0593 1.4149 2.1512 1.2204 1.1001 1.1006 1.0989 2.2341 1.0979 1.0849 6.0504 6.1902 1.0715 1.0707 1.0647 1.0801 1.0693 1.0853 1.0567 1.0995 1.1000 1.0870 1.0868 1.1112 1.0908 1.0958 1.1015 1.0739
irintensity: 0.5268 1.3264 0.2354 1.2634 1.3198 1.6369 1.8527 3.6839 0.3073 1.6827 4.9844 0.4567 5.0463 0.0103 9.2171 20.3408 12.4973 0.0716 45.1443 80.3060 48.7851 55.3106 7.7136 0.9931 5.4199 0.7232 0.5482 3.3455 0.0711 0.1364 0.2189 1.2338 2.2532 1.5738 16.6517 0.4813 2.0326 13.3458 4.2774 27.7600 56.3352 0.1310 0.2106 2.1321 1.1537 4.5720 7.3360 2.7068 4.0515 1.5202 10.3590 0.3905 41.6414 0.1408 1.3173 7.3023 28.7720 4.0760 4.6627 12.0892 16.1384 4.4611 5.2968 1.3713 9.1644 91.6849 118.6349 26.6865 5.8597 33.3443 36.1915 29.6621 25.7623 15.5829 10.2247 6.8514 26.5983 11.4710 46.5437 23.5805 1.3702
temp: 298.150 k
press: 1.00000 atm
elementType: 17 7 6 6 6 6 6 6 6 6 6 6 6 1 1 1 1 1 1 1 1 1 1 1 1 1 1 1 1
symmnumber: 1
zpe: 645511.8 jmol-1
zpe.correction: 0.245862 hartree
zpe.thermalcorrener: 0.259887 hartree
zpe.thermalcorrenthalpy: 0.260831 hartree
zpe.thermalcorrgfe: 0.200851 hartree
zpe.sumelectzpe: -942.572921 hartree
zpe.sumelectthermal: -942.558897 hartree
zpe.sumelectthermalent: -942.557953 hartree
zpe.sumelectthermalfe: -942.617933 hartree
dipole: 2.2219 -0.9314 -1.3037
dipole: 2.7394
quadrupole: -106.3466 -80.0958 -87.5453
quadrupole: 1.6145 1.6828 -1.7230
quadrupole: -15.0174 11.2334 3.7839 1.6145 1.6828 -1.7230
hfenergy: -942.8187837 hartree
pointgroup: C01 [X(C11H16Cl1N1)]
dipole: -0.8694677 -0.3804046 0.5107642 debye
polarizability: 189.0095547|-0.0980907|118.0487813|-21.942019|0.0679081|91.2367283 unknown
InChI: InChI=1S/C11H16ClN/c12-8-4-9-13-10-7-11-5-2-1-3-6-11/h1-3,5-6,13H,4,7-10H2
charge 0 multiplicity 1
29 atoms
Cl 6.983135 0.102364 -0.145938
N  1.701668 -0.071123 -0.506648
C  0.34131 -0.086192 0.070938
C  -0.727923 -0.03658 -1.050306
C  2.798528 -0.051197 0.482583
C  4.166358 0.014403 -0.236487
C  -2.141394 -0.009095 -0.489132
C  5.322076 0.043581 0.763241
C  -2.823259 -1.212978 -0.173183
C  -2.793201 1.223851 -0.227224
C  -4.118817 -1.187738 0.390759
C  -4.088822 1.255195 0.336582
C  -4.756447 0.048078 0.64869
H  0.147544 -0.976416 0.720927
H  0.231048 0.806525 0.717374
H  -0.596291 -0.921827 -1.705412
H  -0.527999 0.857775 -1.668167
H  2.66808 0.849216 1.116151
H  2.780934 -0.933283 1.174297
H  1.828271 -0.82998 -1.192449
H  4.281259 -0.864786 -0.900689
H  4.19124 0.913706 -0.876798
H  5.369807 -0.862609 1.387092
H  5.310723 0.943268 1.397932
H  -2.338156 -2.176008 -0.378179
H  -2.28289 2.163642 -0.473353
H  -4.631813 -2.127762 0.624523
H  -4.578519 2.21714 0.526967
H  -5.762553 0.070032 1.082409
