program: Gaussian 09
title: 000194944
version: EM64L-G09RevD.01
frameworkgroup: C1[X(C16H18N4O3)]
method: RPBEPBE
basis: SDD
operation: Freq
keyword: #p
keyword: freq=noraman
keyword: PBEPBE/SDD
title: #p freq=noraman PBEPBE/SDD
converged: YES YES NO NO
title: Mulliken charges:
elementType: O O O N N N N C C C C C C C C C C C C C C C C H H H H H H H H H H H H H H H H H H
charge: -0.219775 -0.244525 -0.216566 -0.164598 -0.180642 -0.206396 -0.084180 -0.063791 -0.436192 0.208117 0.298911 -0.318652 0.226047 0.288076 -0.638685 -0.595330 0.399523 -0.668644 0.375006 0.055045 -0.603296 -0.819402 -0.820222 0.297582 0.235631 0.228044 0.230270 0.244591 0.257094 0.240147 0.317568 0.239608 0.245927 0.269847 0.243547 0.229936 0.233708 0.228077 0.228668 0.227556 0.232370
chargesum: 0.00000
title: Mulliken charges with hydrogens summed into heavy atoms:
elementType: O O O N N N N C C C C C C C C C C C C C C C C
charge: -0.219775 -0.244525 -0.216566 -0.164598 -0.180642 -0.206396 -0.084180 -0.063791 0.097021 0.208117 0.298911 0.139662 0.226047 0.288076 -0.394094 -0.338236 0.399523 0.128679 0.375006 0.055045 0.156024 -0.127681 -0.131627
polarizability: 3.62675745e+02 9.16847753e+00 2.15262193e+02 4.30956662e+00 5.74588948e+00 1.25686959e+02
1716.lowfreq: -10.8713 -1.4629 -0.0003 0.0009 0.0010 6.5279 39.0688 41.9265 68.8512
frequency: 39.0047 41.9178 68.8463 83.1249 92.5962 108.5249 109.0968 114.1368 138.3751 157.4084 168.1227 186.1232 219.7865 229.4150 236.5275 242.9392 270.0848 292.3104 295.9740 309.6779 330.3505 337.2295 350.9958 384.7059 394.2493 411.1839 434.5289 456.5995 494.1531 496.3304 552.5283 577.3090 607.4368 618.3512 630.4467 637.9886 675.6315 705.3134 719.6511 727.6890 736.9610 740.9340 771.2288 805.5044 818.7975 841.2774 864.3535 865.2878 908.0372 926.9411 949.0838 979.3893 999.0986 1009.8199 1012.0218 1026.5193 1051.0084 1051.5053 1068.6199 1092.4373 1111.7204 1121.8879 1125.9432 1145.9285 1168.8120 1174.9202 1217.6057 1227.0342 1236.4669 1252.0121 1290.4444 1301.6560 1311.4601 1324.8225 1335.0297 1353.4109 1385.4595 1394.1934 1400.6760 1407.8874 1420.9144 1426.3276 1435.7100 1461.1856 1464.3739 1473.0289 1473.5251 1475.4589 1476.6539 1480.2617 1482.2209 1486.5471 1499.7369 1516.7193 1558.4606 1582.4216 1594.6749 1627.2905 1633.5886 2969.3533 2971.0558 2995.4461 3008.3911 3017.7878 3040.2552 3044.3160 3053.0443 3082.0554 3085.7303 3085.9192 3086.9993 3097.8569 3129.5387 3130.1765 3141.9958 3142.6603 3160.1717
redmass: 4.0158 5.1944 2.4686 3.2873 3.7165 1.5301 1.0409 1.9664 1.9606 2.3256 2.4203 5.0935 1.5682 3.3668 3.1738 2.4686 3.6043 3.5751 3.6366 4.9522 3.4677 3.9719 4.2212 6.8436 4.4105 5.3959 5.7937 3.8612 7.3353 5.2856 4.8104 5.0830 7.4106 6.1949 5.5900 5.8202 8.2701 8.2139 9.4187 4.5320 4.6794 5.2425 4.7531 4.6222 2.5410 2.0737 1.3914 1.4803 4.8627 3.6657 5.1431 2.6756 3.2306 1.7154 1.6375 1.4340 2.4639 2.6416 2.8559 2.4111 2.6928 1.3208 1.3245 3.5731 2.4215 1.1949 1.5145 1.9842 2.1266 3.2612 1.5379 2.1600 1.4580 4.4691 1.7666 4.6300 4.5514 1.3290 3.0435 1.2857 1.3227 1.4808 2.1078 1.0474 1.1023 1.1229 1.0651 1.0682 1.0483 1.1444 1.1121 1.5252 1.0758 3.1610 7.6628 8.3278 10.9109 9.2399 7.1817 1.0377 1.0382 1.0342 1.0335 1.0577 1.0971 1.0968 1.0601 1.0983 1.0979 1.1024 1.1088 1.1020 1.1071 1.1003 1.1014 1.0911 1.0905
irintensity: 0.1136 1.0059 2.0578 1.3798 7.6576 0.3995 0.0313 0.9846 5.4431 0.6182 3.3283 4.7162 1.0044 2.9306 0.4936 0.7502 1.4129 1.3162 3.8589 0.6516 5.8986 0.7194 3.0448 19.4865 6.1823 8.4681 4.8189 8.4937 0.7370 9.2609 0.6361 7.5552 59.4819 3.6194 9.7261 8.9396 14.1474 8.4096 33.0080 3.9530 10.6270 3.5868 15.6278 7.2055 15.7386 15.0084 26.6303 3.6155 34.0055 15.2547 12.6104 6.9300 42.8372 47.3745 50.1854 15.0189 1.3476 1.8410 105.4389 8.3083 98.0658 0.5990 1.0446 25.3754 2.5797 0.5005 6.3009 55.2318 17.6515 23.4038 40.3542 61.6242 47.3101 64.2471 9.6840 12.4946 30.6729 19.6096 85.1415 38.6449 58.3869 45.7251 5.4298 0.3140 26.5741 12.4487 31.0501 16.3183 14.4439 7.1053 20.5943 53.0180 18.2972 101.0950 563.5417 214.4239 794.7222 69.4399 46.2537 78.3137 20.0968 38.6852 34.6604 52.1643 37.5757 2.3138 28.3858 30.9278 8.0617 16.1047 14.3262 18.5195 9.9766 1.2572 0.6899 9.9561 6.3727
temp: 298.150 k
press: 1.00000 atm
elementType: 8 8 8 7 7 7 7 6 6 6 6 6 6 6 6 6 6 6 6 6 6 6 6 1 1 1 1 1 1 1 1 1 1 1 1 1 1 1 1 1 1
symmnumber: 1
zpe: 846745.0 jmol-1
zpe.correction: 0.322508 hartree
zpe.thermalcorrener: 0.343645 hartree
zpe.thermalcorrenthalpy: 0.344589 hartree
zpe.thermalcorrgfe: 0.273364 hartree
zpe.sumelectzpe: -1063.517986 hartree
zpe.sumelectthermal: -1063.496849 hartree
zpe.sumelectthermalent: -1063.495905 hartree
zpe.sumelectthermalfe: -1063.567130 hartree
dipole: -7.1061 -2.0112 0.0984
dipole: 7.3858
quadrupole: -134.0564 -128.8037 -137.9135
quadrupole: -13.3790 -3.7794 -7.5788
quadrupole: -0.4652 4.7875 -4.3223 -13.3790 -3.7794 -7.5788
hfenergy: -1063.840494 hartree
pointgroup: C01 [X(C16H18N4O3)]
dipole: 2.8107182 -0.7325991 -0.0832708 debye
polarizability: 362.9252772|-6.7038153|215.2997576|5.0947902|1.4752264|125.3998625 unknown
InChI: InChI=1S/C16H18N4O3/c1-9-7-11-12(8-10(9)2)20-5-6-23-16(20)13(18(11)3)17-15(22)19(4)14(16)21/h7-8H,5-6H2,1-4H3
charge 0 multiplicity 1
41 atoms
O  -1.410169 -0.707721 -1.742306
O  -2.341569 -2.174972 0.931238
O  -4.390849 1.910344 -0.038039
N  0.151354 -1.182301 -0.043617
N  0.278662 1.663228 -0.101094
N  -3.380308 -0.12293 0.552774
N  -2.058954 1.820202 -0.082433
C  -1.060314 -0.429632 -0.269973
C  0.009207 -2.469333 -0.783018
C  -0.965823 1.070582 -0.119666
C  1.400759 -0.5269 0.035942
C  -0.973167 -2.112746 -1.959072
C  1.477271 0.896877 -0.001492
C  -2.291225 -0.987878 0.496914
C  2.599625 -1.263546 0.195509
C  2.743145 1.523736 0.091542
C  3.862778 -0.639932 0.280019
C  0.351962 3.141643 -0.094741
C  3.938316 0.784718 0.221362
C  -3.32351 1.257573 0.093949
C  -4.666426 -0.66078 1.049148
C  5.115196 -1.479932 0.447619
C  5.272777 1.501815 0.312465
H  -0.424109 -3.239336 -0.130099
H  0.993797 -2.790184 -1.156122
H  -0.47905 -2.132386 -2.944181
H  -1.852047 -2.781235 -1.955557
H  2.542796 -2.353335 0.28508
H  2.809509 2.614544 0.060142
H  0.799269 3.501897 0.848271
H  -0.675602 3.521073 -0.181992
H  0.957626 3.490264 -0.948785
H  -4.935415 -1.569816 0.486286
H  -5.428301 0.118157 0.904001
H  -4.58148 -0.925551 2.116538
H  5.65297 -1.226589 1.381484
H  4.877283 -2.556406 0.478838
H  5.828603 -1.315352 -0.382731
H  5.788342 1.286444 1.268402
H  5.961015 1.188765 -0.496159
H  5.147354 2.595431 0.240053
