program: Gaussian 09
title: 000194919
version: EM64L-G09RevD.01
frameworkgroup: C1[X(C11H21NO4S)]
method: RPBEPBE
basis: SDD
operation: Freq
keyword: #p
keyword: freq=noraman
keyword: PBEPBE/SDD
title: #p freq=noraman PBEPBE/SDD
converged: YES YES NO NO
title: Mulliken charges:
elementType: S O O O O N C C C C C C C C C C C H H H H H H H H H H H H H H H H H H H H H
charge: 0.154734 -0.322751 -0.307793 -0.447111 -0.225499 -0.080746 -0.385540 -0.018949 -0.587401 -0.597371 -0.579067 -0.548570 0.122372 0.284670 -0.479016 -0.646457 -0.835735 0.220744 0.315602 0.276662 0.223295 0.241115 0.348948 0.339277 0.260744 0.214440 0.244396 0.241841 0.289251 0.249785 0.214098 0.264765 0.243680 0.273792 0.262769 0.257927 0.255763 0.261337
chargesum: 0.00000
title: Mulliken charges with hydrogens summed into heavy atoms:
elementType: S O O O O N C C C C C C C C C C C
charge: 0.154734 -0.322751 -0.307793 -0.447111 -0.225499 -0.080746 0.150806 0.257713 0.225957 0.217090 0.196421 -0.084686 0.122372 0.284670 0.029429 -0.109896 -0.060708
polarizability: 2.12436022e+02 3.22204386e+00 1.61529733e+02 2.18384687e+00 -7.97379576e+00 1.19520950e+02
1716.lowfreq: -6.3386 -0.0011 0.0009 0.0014 5.3195 14.3302 20.3154 29.5707 36.5332
frequency: 19.7577 29.5228 36.2972 43.0511 46.7332 63.6937 81.9791 92.9838 98.9320 148.9023 160.8545 171.2736 182.7355 206.6119 240.0189 256.9356 259.4856 290.9777 294.0690 320.0942 325.1808 371.1644 390.8554 409.3533 425.3215 450.7466 458.8412 473.2144 546.3484 585.1935 592.3883 637.5540 667.9350 684.2196 711.6549 755.3971 776.3237 782.3178 832.6678 837.4832 878.9108 902.5893 933.1178 939.5546 959.5117 972.7100 982.2666 990.0126 998.7249 1060.5609 1069.2353 1103.7799 1110.1133 1117.7658 1134.7274 1138.5570 1167.9217 1199.9308 1223.5534 1235.6537 1246.3580 1249.2638 1260.2495 1267.9588 1297.5628 1328.4868 1336.0719 1353.5989 1356.7956 1384.0279 1406.8661 1411.5777 1420.8451 1443.5917 1445.0195 1451.4758 1451.7657 1458.7374 1463.8807 1469.0457 1475.2125 1479.8196 1481.3261 1499.6452 1543.6171 1590.7263 1647.9597 2923.2800 2990.1247 2995.4118 3003.5198 3007.3240 3014.4341 3023.0639 3026.0470 3028.9250 3046.3231 3076.3370 3095.4886 3097.3643 3103.5462 3112.7337 3117.2471 3123.8814 3127.9977 3132.7814 3142.1195 3146.5247
redmass: 3.2528 7.7079 5.9684 4.7677 7.6341 2.2064 3.2669 3.8999 3.3364 5.1344 1.1392 3.4635 4.8183 5.0914 3.5710 1.6257 2.6288 2.7242 3.2816 1.4089 3.4824 1.6453 2.1470 1.3866 2.7578 2.2462 2.2282 3.6014 2.9535 4.4798 4.1322 6.2746 7.5399 4.9103 5.8594 4.1410 2.0966 1.7949 6.9797 3.2542 3.7310 4.2570 2.6729 3.0149 1.2691 2.1277 1.3671 1.4103 1.9706 1.2093 4.2004 1.8379 1.9186 1.3962 1.2783 1.7453 1.4823 3.1215 1.5741 1.7415 1.3232 1.3764 1.8068 1.1421 1.2858 1.3162 1.4861 1.2358 1.2923 1.1164 1.1967 1.1327 1.1499 1.0874 1.1335 1.0528 1.0917 1.0706 1.0750 1.0757 1.0622 1.0634 1.0644 1.0530 1.0546 7.0554 9.8732 1.0493 1.0326 1.0604 1.0291 1.0773 1.0331 1.0637 1.0608 1.0567 1.0992 1.0900 1.1022 1.1052 1.1084 1.1052 1.1059 1.1047 1.1038 1.1025 1.1043 1.1031
irintensity: 1.6629 2.0143 7.4022 2.3003 1.2054 0.0292 5.3390 2.3283 1.1103 12.3519 0.3317 3.6360 7.1209 24.3688 12.0384 10.7561 9.8086 2.4481 4.9067 1.8214 3.5064 0.8053 0.8019 2.6511 2.9573 0.8245 7.8143 3.4437 3.6229 17.4048 12.7212 2.3172 1.2387 16.2030 29.3101 2.4420 45.9719 34.0075 24.4291 76.0255 72.0110 17.0417 30.4960 109.0985 6.0462 6.7552 20.5532 2.1646 56.5074 1.9653 170.4587 146.5146 135.9990 37.5619 28.3015 7.5344 46.0745 146.4366 0.8181 13.9795 30.4645 4.6266 1.8552 0.4675 7.7524 38.3322 41.0231 14.3470 8.0156 33.6350 24.9052 28.2801 39.0935 30.9105 34.6811 16.8357 48.3030 11.5392 10.0144 2.9870 17.5988 29.8891 3.7102 22.9154 56.1283 425.8018 164.8167 132.3179 50.8749 18.5673 36.0607 13.2002 17.5012 39.3569 29.0840 14.5531 3.1310 8.2048 11.6620 2.4441 25.1111 7.8140 16.6004 0.6966 25.3668 10.7050 1.4669 11.6483
temp: 298.150 k
press: 1.00000 atm
elementType: 16 8 8 8 8 7 6 6 6 6 6 6 6 6 6 6 6 1 1 1 1 1 1 1 1 1 1 1 1 1 1 1 1 1 1 1 1 1
symmnumber: 1
zpe: 828020.6 jmol-1
zpe.correction: 0.315376 hartree
zpe.thermalcorrener: 0.335986 hartree
zpe.thermalcorrenthalpy: 0.336930 hartree
zpe.thermalcorrgfe: 0.263265 hartree
zpe.sumelectzpe: -1184.045732 hartree
zpe.sumelectthermal: -1184.025122 hartree
zpe.sumelectthermalent: -1184.024178 hartree
zpe.sumelectthermalfe: -1184.097843 hartree
dipole: 5.0129 11.8121 1.6548
dipole: 12.9380
quadrupole: -130.8154 -121.2717 -108.5297
quadrupole: -45.8517 -3.4826 2.4026
quadrupole: -10.6098 -1.0661 11.6759 -45.8517 -3.4826 2.4026
hfenergy: -1184.3611079 hartree
pointgroup: C01 [X(C11H21N1O4S1)]
dipole: -1.3588142 -4.8621825 0.6504357 debye
polarizability: 208.622052|10.1638029|162.2226145|-14.9457416|8.0584416|122.6420388 unknown
InChI: InChI=1S/C11H21NO4S/c1-12(2,3)8-9(7-10(13)14)16-11(15)5-6-17-4/h9H,5-8H2,1-4H3
charge 0 multiplicity 1
38 atoms
S  -5.23739 -1.344175 0.070159
O  -0.168746 -0.289284 0.156373
O  3.068232 3.329829 -0.47865
O  3.712738 1.124821 -0.914892
O  -1.451256 1.098062 1.534426
N  2.519025 -1.606714 -0.268785
C  2.199698 -0.489293 0.779458
C  1.080636 0.516663 0.493301
C  4.02996 -1.841923 -0.205629
C  2.175864 -1.226795 -1.711401
C  1.762602 -2.873649 0.102426
C  1.332067 1.604296 -0.566947
C  2.845516 2.087657 -0.64906
C  -1.380559 0.165461 0.706221
C  -2.547844 -0.630736 0.143104
C  -3.868878 -0.297368 0.851158
C  -6.6933 -0.67487 1.056514
H  1.977712 -1.038517 1.711715
H  3.12538 0.099108 0.87694
H  0.881078 1.010941 1.465151
H  4.290334 -2.676613 -0.876524
H  4.31073 -2.087832 0.831075
H  4.500837 -0.897055 -0.527407
H  2.727613 -0.285036 -1.9071
H  1.087618 -1.097766 -1.789575
H  2.518155 -2.050203 -2.360403
H  2.09067 -3.216316 1.09683
H  1.975166 -3.651036 -0.648646
H  0.68844 -2.637699 0.117804
H  0.696802 2.476528 -0.342038
H  1.053518 1.225867 -1.566873
H  -2.62424 -0.410002 -0.939693
H  -2.318321 -1.710575 0.220963
H  -4.119882 0.768959 0.72964
H  -3.81179 -0.527783 1.928142
H  -6.553074 -0.873792 2.131019
H  -7.588189 -1.205731 0.696776
H  -6.809823 0.406172 0.879326
