program: Gaussian 09
title: 000194867
version: EM64L-G09RevD.01
frameworkgroup: C1[X(C5H11NO3S)]
method: RPBEPBE
basis: SDD
operation: Freq
keyword: #p
keyword: freq=noraman
keyword: PBEPBE/SDD
title: #p freq=noraman PBEPBE/SDD
converged: YES YES NO NO
title: Mulliken charges:
elementType: S O O O N C C C C C H H H H H H H H H H H
charge: 1.020408 -0.576811 -0.520332 -0.514579 -0.562224 -0.412589 -0.120308 -0.415817 -0.441813 -0.422613 0.331750 0.269275 0.237561 0.276634 0.253562 0.198447 0.228341 0.223673 0.307619 0.262739 0.377078
chargesum: 0.00000
title: Mulliken charges with hydrogens summed into heavy atoms:
elementType: S O O O N C C C C C
charge: 1.020408 -0.199732 -0.520332 -0.514579 0.008133 -0.080840 0.148967 0.098377 0.010197 0.029401
polarizability: 1.13958151e+02 -2.88470555e+00 9.66999927e+01 6.28050079e-01 2.49223079e-01 8.09551437e+01
1716.lowfreq: -0.0027 -0.0015 0.0015 4.8051 11.3219 15.6416 25.6682 51.1975 126.5120
frequency: 23.9528 50.6601 126.5030 162.0641 177.7763 184.9020 211.9972 257.0283 296.6297 307.4175 325.1430 349.1427 403.7461 424.6366 523.8152 544.8826 567.3315 587.5311 616.4893 812.1028 829.1064 841.9465 881.4970 903.6767 948.8214 954.8914 1004.5430 1026.7149 1046.0533 1073.7188 1097.0776 1130.5770 1169.4943 1193.7682 1221.1673 1241.6353 1244.3143 1290.1374 1304.9207 1312.8014 1323.0242 1377.4427 1460.2898 1466.8160 1480.9492 1639.3580 2987.5186 3009.1530 3011.5271 3016.0402 3063.5968 3075.0763 3084.8611 3092.5553 3470.9864 3493.8349 3603.7444
redmass: 5.4547 2.9829 5.2769 3.7201 3.0294 2.0165 2.4563 2.6192 3.8632 5.0620 1.6332 2.3658 3.3247 3.7597 3.2451 5.4629 1.9346 2.2995 2.5298 1.7817 3.0929 4.7623 1.7860 2.6787 10.6520 2.0674 1.4079 1.2134 2.3186 2.9198 1.3914 1.3696 1.8929 1.3350 1.3834 1.3466 1.4135 1.2682 1.2464 1.3934 1.3965 1.3617 1.0739 1.0829 1.0931 1.0954 1.0688 1.0616 1.0814 1.0640 1.1001 1.0916 1.0977 1.1020 1.0445 1.0664 1.0995
irintensity: 0.7412 0.6211 1.1873 19.5162 11.8386 8.6846 23.2388 55.2603 44.5914 13.9706 26.5029 3.6839 38.4256 11.4377 140.8735 168.5564 107.1610 104.4543 36.7087 20.3203 17.5966 15.2674 2.6041 5.6781 92.2166 15.4221 4.6714 60.4351 11.1016 8.6721 7.3670 10.6965 11.3423 7.2118 11.4818 0.7141 7.0830 3.4870 1.2373 7.6818 2.4848 9.1103 15.3648 8.6375 12.6617 52.0360 24.7811 16.9925 16.8852 22.9497 3.8506 12.6127 11.4548 37.8627 5.5749 41.9860 7.0042
temp: 298.150 k
press: 1.00000 atm
elementType: 16 8 8 8 7 6 6 6 6 6 1 1 1 1 1 1 1 1 1 1 1
symmnumber: 1
zpe: 432613.9 jmol-1
zpe.correction: 0.164774 hartree
zpe.thermalcorrener: 0.176653 hartree
zpe.thermalcorrenthalpy: 0.177597 hartree
zpe.thermalcorrgfe: 0.126349 hartree
zpe.sumelectzpe: -874.625762 hartree
zpe.sumelectthermal: -874.613883 hartree
zpe.sumelectthermalent: -874.612939 hartree
zpe.sumelectthermalfe: -874.664187 hartree
dipole: -2.6500 -0.7855 2.8784
dipole: 3.9905
quadrupole: -64.6383 -72.4215 -70.4988
quadrupole: 2.8465 3.0265 1.6982
quadrupole: 4.5479 -3.2353 -1.3126 2.8465 3.0265 1.6982
hfenergy: -874.7905362 hartree
pointgroup: C01 [X(C5H11N1O3S1)]
dipole: -1.086622 0.3884245 -1.0645585 debye
dipolederiv: 1.3723941 0.0747509 -0.1577581 0.0161808 1.2127452 -0.0201473 -0.1931776 -0.0014827 1.3542475 -0.748521 -0.0890497 0.4054296 -0.0592209 -0.574538 0.0463332 0.5357182 0.1156618 -0.7931572 -0.6019394 0.0856188 -0.0288845 0.0542252 -0.6822547 0.0919468 -0.0645577 0.0529076 -0.4738546 -0.619976 -0.0364912 -0.0643272 -0.0204386 -0.6058841 -0.1248714 -0.1799418 -0.1394915 -0.542778 -0.5600638 -0.2369813 0.1907665 -0.3717439 -0.8958911 0.0222849 0.2330658 0.0373968 -0.306731 0.2897717 -0.2140074 0.0205471 -0.1238689 -0.1571955 -0.0053371 0.0646518 0.0406906 -0.0243522 0.2176551 0.0897059 -0.0604719 0.4800611 0.7226218 0.090273 -0.2933908 0.0115116 0.2217731 -0.0306591 -0.0219702 0.0281123 -0.1049799 -0.089001 -0.0463444 -0.0044141 -0.0000281 0.0750396 0.017727 0.0765998 0.0109737 -0.0951071 -0.0553525 -0.0206247 0.173421 0.0217754 0.1646164 0.0462778 0.0049984 0.0333819 -0.0154657 0.0226199 -0.0196955 -0.0465523 0.0420919 0.1271174 -0.0492142 0.0210826 -0.0128185 0.0344992 0.0397186 -0.046334 0.0153215 -0.0306472 0.0023674 0.0478332 -0.0206199 -0.0731401 -0.0323526 0.0271507 -0.0268478 -0.034291 -0.013928 -0.0648983 0.0261565 0.0678517 -0.0111254 0.036018 0.0303025 0.0554607 0.0125434 0.0841142 -0.0834449 0.047802 -0.1035625 -0.0136422 -0.0474756 0.0741273 -0.0123889 0.0032258 -0.0580113 0.0697723 -0.0739883 -0.0596821 0.0759134 -0.042676 0.0420541 0.0492175 0.1177092 0.0509653 0.0033463 0.0454972 0.0005333 -0.0513867 -0.008558 0.030707 -0.0364333 -0.1273855 -0.0507653 -0.1315067 -0.0689968 0.1254103 -0.014985 0.1227509 -0.0498411 0.0205714 -0.0343105 0.0432015 0.0757028 0.0464535 -0.0426352 -0.0507182 -0.0227577 0.0585104 -0.0095859 0.0096783 -0.0500789 -0.1391437 0.159553 0.1892149 -0.0652195 0.1100484 0.2907601 -0.068586 -0.0795628 -0.1387555 0.2168047 0.3002005 0.0830346 -0.0295903 0.0945109 0.2035439 0.0456614 -0.0844311 -0.0421557 0.0328589 0.1360371 0.0061982 -0.1310568 -0.0036498 0.3550964 0.0154477 -0.0233198 0.0250276 0.2162202 unknown
polarizability: 113.9102665|2.8050046|96.5552094|-1.8766384|1.1036366|81.147812 unknown
InChI: InChI=1S/C5H11NO3S/c6-4-2-1-3-5(4)10(7,8)9/h4-5,7H,1-3,6H2
charge 0 multiplicity 1
21 atoms
S  1.595668 -0.003418 0.057386
O  2.410393 0.272893 -1.607029
O  1.869009 -1.529689 0.536557
O  2.008181 1.19984 1.062839
N  -1.220432 -2.189087 -0.368782
C  -0.225094 0.17766 -0.635066
C  -1.148925 -0.831687 0.141103
C  -0.766326 1.606272 -0.441171
C  -2.496587 -0.05764 0.120201
C  -2.089871 1.415546 0.368603
H  -0.049413 -0.127472 -1.680099
H  -0.807915 -0.884023 1.192991
H  -0.956096 2.063508 -1.427642
H  -0.04672 2.256957 0.0878
H  -3.189304 -0.461726 0.876078
H  -2.976827 -0.170779 -0.872941
H  -2.867492 2.133408 0.058082
H  -1.90166 1.57593 1.446385
H  -0.401042 -2.767788 -0.164619
H  -1.571618 -2.287412 -1.324952
H  3.400071 0.297207 -1.464422
