program: Gaussian 09
title: 000194878
version: EM64L-G09RevD.01
frameworkgroup: C1[X(C13H20O3)]
method: RPBEPBE
basis: SDD
operation: Freq
keyword: #pfreq=noraman
keyword: PBEPBE/SDD
title: #p freq=noraman PBEPBE/SDD
converged: YES YES NO NO
title: Mulliken charges:
elementType: O O O C C C C C C C C C C C C C H H H H H H H H H H H H H H H H H H H H
charge: -0.276305 -0.222637 -0.198121 -0.182584 -0.030087 0.305608 -0.320110 0.075517 0.075803 -0.737172 -0.739203 0.203082 -0.710016 -0.827379 -0.465308 -0.687777 0.241436 0.222949 0.266107 0.231007 0.225457 0.248172 0.239640 0.233154 0.218771 0.234535 0.230096 0.244224 0.230120 0.228060 0.277372 0.251814 0.238882 0.212916 0.228032 0.233945
chargesum: 0.00000
title: Mulliken charges with hydrogens summed into heavy atoms:
elementType: O O O C C C C C C C C C C C C C
charge: -0.276305 -0.222637 -0.198121 0.058852 0.192863 0.305608 -0.054002 0.075517 0.075803 -0.032536 -0.047638 0.203082 -0.001161 -0.091828 0.025388 -0.012884
polarizability: 1.81149174e+02 4.20217734e+00 1.49487818e+02 -9.48155672e+00 -3.02787428e+00 1.24000066e+02
1716.lowfreq: -3.1041 -0.0005 -0.0002 0.0001 6.9074 12.3027 22.7225 29.9394 53.4571
frequency: 22.4112 29.6385 53.4427 83.8905 85.8283 98.4035 125.9451 151.5055 161.3753 181.4150 196.4342 203.3317 210.1578 231.5749 233.7589 257.2534 268.5117 284.3618 312.6886 328.7277 359.9483 366.1322 400.8821 464.6052 507.2620 540.9321 579.6093 609.3447 656.1444 687.3832 691.1243 744.0930 746.1558 797.3878 821.0843 832.6988 899.4750 943.1344 959.7653 987.7476 996.3778 1008.6107 1015.0701 1038.0238 1044.3107 1063.2267 1076.7172 1090.2816 1110.8100 1112.8970 1139.1765 1143.6920 1169.9837 1213.5857 1244.4111 1249.8840 1268.3101 1293.8844 1310.4727 1331.6178 1338.2016 1343.8015 1355.3568 1384.2484 1386.9505 1394.8571 1395.2364 1398.4871 1431.1096 1461.3216 1466.5847 1469.8024 1472.4887 1474.1988 1476.1168 1478.9585 1479.2915 1487.9080 1490.3498 1565.2963 1591.2537 1629.1105 2951.7022 2964.5080 2976.0365 2990.1404 2997.6962 2997.8230 2999.9618 3014.9312 3020.7671 3039.4850 3056.0832 3085.6387 3093.2160 3093.7054 3094.3534 3095.0739 3098.6679 3100.6928 3105.4285 3112.8398
redmass: 4.9652 4.3137 3.7594 3.0406 2.1527 2.9495 1.0193 2.9639 2.6753 1.4191 1.2003 1.4389 1.5413 1.5919 2.2781 2.7778 1.7413 3.2198 3.1644 4.2366 5.3345 4.5879 4.6671 5.3539 4.0446 3.0431 2.9656 3.0581 3.5886 3.9931 5.1098 3.4237 4.1441 1.4480 3.0674 2.4026 2.2455 2.0752 1.7840 1.5696 1.8418 1.5176 1.6787 1.4465 1.8416 1.9166 2.4036 2.0393 2.3190 2.5851 2.6369 2.8269 1.9489 3.1357 1.1950 1.3862 1.2355 1.4617 1.4566 1.4677 1.6517 2.6734 2.0765 1.2062 1.2754 1.2435 1.2395 1.2104 1.0961 1.0511 1.0777 1.0395 1.0478 1.0492 1.0535 1.0544 1.0516 1.0511 1.0516 9.4007 7.6512 8.5590 1.0843 1.0634 1.0384 1.0350 1.0365 1.0363 1.0344 1.0939 1.0843 1.0842 1.0965 1.0999 1.0991 1.1004 1.0982 1.1002 1.1005 1.0997 1.0999 1.1011
irintensity: 3.9590 0.9751 0.3078 4.1722 1.4375 0.5536 0.1693 0.2789 1.2068 0.4401 0.1067 1.0359 0.1799 1.6155 1.5771 2.0550 0.5290 7.0615 3.2727 8.9190 2.9163 7.5663 0.8621 4.9671 0.5558 4.2589 2.2571 2.6231 3.4032 18.3956 2.1244 5.0483 3.7987 6.8948 4.0007 7.0201 5.3843 46.1252 7.7653 16.1744 62.8724 7.7304 19.1757 5.0402 34.7276 29.3277 14.9347 29.6744 14.5646 10.8596 78.2478 42.4737 8.7536 37.4078 0.6230 11.7272 1.2295 3.4752 10.3586 34.8494 23.4798 83.3723 37.5810 19.5993 36.0391 8.5172 48.6548 18.7334 38.0707 8.4199 12.1009 15.5781 16.9757 20.6842 7.2545 13.0403 30.6911 17.5677 3.6537 348.0642 84.9208 113.7788 32.8963 26.2711 30.0938 20.3053 16.0347 28.6266 21.9974 4.5025 10.7442 2.6435 19.9245 29.7693 15.3900 24.8285 2.1049 20.1357 15.9714 25.9661 22.6972 16.7438
temp: 298.150 k
press: 1.00000 atm
elementType: 8 8 8 6 6 6 6 6 6 6 6 6 6 6 6 6 1 1 1 1 1 1 1 1 1 1 1 1 1 1 1 1 1 1 1 1
symmnumber: 1
zpe: 794898.1 jmol-1
zpe.correction: 0.302761 hartree
zpe.thermalcorrener: 0.321399 hartree
zpe.thermalcorrenthalpy: 0.322343 hartree
zpe.thermalcorrgfe: 0.255458 hartree
zpe.sumelectzpe: -731.794967 hartree
zpe.sumelectthermal: -731.776329 hartree
zpe.sumelectthermalent: -731.775385 hartree
zpe.sumelectthermalfe: -731.842270 hartree
dipole: 0.6359 -4.1578 0.4064
dipole: 4.2257
quadrupole: -113.8623 -99.1697 -95.0374
quadrupole: -6.1340 6.4505 5.4761
quadrupole: -11.1725 3.5201 7.6524 -6.1340 6.4505 5.4761
hfenergy: -732.0977282 hartree
pointgroup: C01 [X(C13H20O3)]
dipole: -0.1026907 1.644334 -0.2227933 debye
polarizability: 180.9508242|3.7420458|148.6931178|11.0350827|-3.4223335|124.9931155 unknown
InChI: InChI=1S/C13H20O3/c1-6-11(14)8(3)13-9(4)12(15)7(2)10(5)16-13/h7-8,10H,6H2,1-5H3
charge 0 multiplicity 1
36 atoms
O  -0.225527 0.982115 0.170383
O  -2.872945 -2.106063 -0.745614
O  3.631008 -1.180237 0.868059
C  -2.510819 0.307462 -0.567405
C  -1.273906 1.165774 -0.89287
C  0.058671 -0.338745 0.519583
C  1.349348 -0.460201 1.299302
C  -2.076073 -1.165905 -0.429941
C  -0.749675 -1.411496 0.172181
C  -3.27189 0.741883 0.712527
C  -1.502145 2.670681 -0.998826
C  2.623126 -0.588708 0.404602
C  1.58112 0.724693 2.284739
C  -0.363374 -2.848013 0.475174
C  2.613202 0.051868 -0.979611
C  3.976251 0.013026 -1.689383
H  -3.204504 0.359944 -1.428169
H  -0.815291 0.773784 -1.827958
H  1.315531 -1.392355 1.890292
H  -2.59735 0.782036 1.586461
H  -3.7332 1.737235 0.585729
H  -4.077387 0.018989 0.926894
H  -1.870364 3.085014 -0.04566
H  -0.561781 3.186298 -1.258982
H  -2.245481 2.886535 -1.787116
H  1.643409 1.68721 1.751311
H  0.746481 0.789243 3.004224
H  2.517081 0.556396 2.843762
H  -0.370701 -3.062001 1.561338
H  0.639285 -3.107277 0.090363
H  -1.104146 -3.513325 0.001204
H  2.232041 1.087858 -0.876554
H  1.83968 -0.475775 -1.578102
H  3.905023 0.467633 -2.693428
H  4.738997 0.561446 -1.110006
H  4.335506 -1.024422 -1.797306
