program: Gaussian 09
title: 000194863
version: EM64L-G09RevD.01
frameworkgroup: C1[X(C9H11NO2S)]
method: RPBEPBE
basis: SDD
operation: Freq
keyword: #p
keyword: freq=noraman
keyword: PBEPBE/SDD
title: #p freq=noraman PBEPBE/SDD
converged: YES YES NO NO
title: Mulliken charges:
elementType: S O O N C C C C C C C C C H H H H H H H H H H H
charge: 0.207668 -0.484951 -0.265354 -0.428371 0.320036 0.120290 -0.315055 -0.198863 -0.279843 -0.242245 0.206179 -0.797420 -0.869623 0.313501 0.229082 0.241649 0.348364 0.236111 0.236788 0.265001 0.368744 0.259875 0.262324 0.266115
chargesum: 0.00000
title: Mulliken charges with hydrogens summed into heavy atoms:
elementType: S O O N C C C C C C C C C
charge: 0.207668 -0.116207 -0.265354 -0.080007 0.320036 0.120290 -0.001554 -0.198863 -0.050761 -0.000596 0.206179 -0.059520 -0.081309
polarizability: 2.22605775e+02 -3.02026725e+00 1.32289989e+02 -1.51253612e-02 1.46577605e-01 6.03426223e+01
1716.lowfreq: -73.5781 -5.3716 -0.8937 -0.0030 -0.0018 -0.0013 13.1979 26.6389 61.9130
frequency: -73.5306 26.4498 61.9113 76.2091 117.4044 151.7764 175.2591 202.5406 239.7006 249.4305 285.0458 298.7890 326.0494 352.8441 396.8195 443.6262 470.7472 538.2923 571.4886 592.2128 592.9189 661.7361 681.4227 707.7824 728.6553 804.4683 806.0327 832.5208 863.8470 934.1468 964.4553 975.7770 987.1514 989.9168 1030.6600 1065.8970 1096.3476 1151.5949 1211.3169 1230.8463 1268.0897 1315.1798 1345.1035 1373.0368 1376.1312 1416.5077 1448.2230 1454.6325 1463.7291 1467.8746 1494.5002 1505.9570 1595.4795 1621.3239 1626.7011 2987.4137 3002.7172 3072.3472 3117.2602 3131.0856 3134.9919 3135.8312 3146.7562 3194.3252 3507.5614 3615.3510
redmass: 1.0508 3.3599 4.7700 5.8263 4.8747 4.0394 3.8393 2.3718 1.4428 5.5004 6.1904 1.1496 4.9043 4.5600 5.2782 3.1234 4.1644 8.4919 3.7766 3.6013 4.4139 6.4130 7.3696 1.5038 2.1193 1.5480 4.4824 1.3716 6.5463 6.5914 1.1812 1.3009 1.5070 1.3951 1.6574 2.1092 2.1950 1.2241 1.7722 3.2776 1.4858 2.0184 1.1818 2.1499 1.8303 4.5512 1.1279 1.0531 1.0736 1.0470 2.1155 2.5541 5.7199 6.8751 5.1313 1.0382 1.0293 1.0983 1.1062 1.0997 1.0981 1.0916 1.0908 1.0949 1.0766 1.0665
irintensity: 0.0538 1.0465 0.2455 8.7596 2.4286 0.3309 4.8413 0.4044 0.6359 1.8837 4.0979 144.1873 1.0557 6.4459 12.1709 17.3143 10.0537 7.5151 6.3970 3.3657 5.1918 3.8407 6.7912 34.0589 46.3009 36.1202 6.0477 41.9718 44.9013 28.5011 12.8330 3.9234 13.2393 18.5326 8.3906 89.8141 74.1222 44.7880 42.4164 38.2543 51.5536 47.0993 8.1459 40.3791 75.9246 53.8332 76.5720 15.7134 65.4786 18.9466 23.3069 572.3361 67.1425 80.8900 89.7985 10.1021 28.4835 16.3552 21.0790 6.0288 8.5940 12.7199 3.7684 5.4392 43.6105 39.0369
temp: 298.150 k
press: 1.00000 atm
elementType: 16 8 8 7 6 6 6 6 6 6 6 6 6 1 1 1 1 1 1 1 1 1 1 1
symmnumber: 1
zpe: 482766.2 jmol-1
zpe.correction: 0.183876 hartree
zpe.thermalcorrener: 0.197000 hartree
zpe.thermalcorrenthalpy: 0.197944 hartree
zpe.thermalcorrgfe: 0.143282 hartree
zpe.sumelectzpe: -951.864066 hartree
zpe.sumelectthermal: -951.850942 hartree
zpe.sumelectthermalent: -951.849998 hartree
zpe.sumelectthermalfe: -951.904660 hartree
dipole: -1.7437 5.9568 0.0280
dipole: 6.2068
quadrupole: -74.5698 -78.6363 -88.2363
quadrupole: 2.0653 -0.3955 0.0026
quadrupole: 5.9110 1.8445 -7.7555 2.0653 -0.3955 0.0026
hfenergy: -952.047942 hartree
pointgroup: C01 [X(C9H11N1O2S1)]
dipole: 0.8181337 -2.2992241 0.0860154 debye
dipolederiv: -0.6823227 0.0007341 -0.0526903 -0.1305473 0.050216 -0.0207795 -0.0317534 -0.0027203 -0.0912852 -0.2245059 -0.3135596 0.0137432 -0.3020092 -1.270685 -0.0276351 0.0133127 -0.0262493 -0.4208494 -0.7497123 -0.0339883 -0.0337947 0.6881246 -0.9196606 0.0535532 -0.0302436 -0.005916 -0.3512935 -1.9459988 0.1196441 -0.1358296 0.3576852 -0.4286752 0.0289306 -0.1329343 0.0097158 -0.3174193 1.0352878 0.2503862 0.0810421 0.1751844 -0.2235412 0.0134415 0.0813189 0.0192316 0.0619697 0.0232024 0.1397578 0.0009895 0.3021611 1.1591809 0.0281268 0.0024769 0.0131971 0.0285307 0.0729053 0.0913361 0.0171958 0.040333 0.0640663 0.0037901 0.0182905 0.0074673 -0.1452671 1.0795605 0.2195529 0.0970725 0.0751422 -0.0399813 0.0148918 0.0900096 0.023187 -0.0674606 -0.3436785 -0.2207517 -0.017021 -0.1793001 -0.1815053 -0.0154669 -0.005818 -0.016393 -0.1737068 -0.5554153 -0.0827142 -0.0346145 0.134737 0.0653842 0.0113961 -0.0421668 -0.0067043 -0.1541082 1.9452902 -0.1112817 0.1480102 -0.9921717 1.1601666 -0.0761234 0.1466747 -0.0030336 0.1757913 -0.3738439 -0.152917 -0.0369377 -0.2939573 -0.1360981 -0.0266281 -0.0415777 -0.015764 0.0558454 0.0180749 -0.1161642 -0.0017725 -0.150899 0.0710715 -0.010645 -0.0152044 -0.0091394 0.0799023 0.1333628 0.0613447 -0.0039912 0.026283 0.088119 0.0019576 -0.0034793 0.0049894 0.1807982 0.0363942 0.0902806 -0.0089412 0.0935765 -0.0493345 0.007191 -0.0085948 0.0065985 0.1618461 0.0726295 -0.0665305 -0.007047 -0.0624031 -0.0418279 -0.0067818 -0.0090616 -0.0064538 0.1621857 0.218082 -0.012294 -0.0078259 -0.0498114 0.1924757 -0.004418 -0.0086877 -0.0014456 0.3127321 0.0505255 -0.0069128 -0.0278456 -0.0498568 0.0254469 0.102948 0.0292546 0.1136531 -0.0317405 0.047825 0.0095283 0.0403267 -0.0327532 0.0316677 -0.1072254 -0.016656 -0.1109665 -0.0355422 -0.0277061 0.0507658 -0.0115876 0.1213923 0.032156 0.0083183 -0.0099431 0.0031174 0.1286447 0.0945333 0.1298413 -0.0231397 0.0705773 0.3730965 0.0058858 -0.0235052 0.0101104 0.3882338 0.1038333 -0.0045811 -0.0397136 0.1022801 -0.0656147 -0.0967727 -0.0191647 -0.0839921 -0.0438747 0.0828419 -0.021502 0.0712015 0.0807045 -0.0513782 0.1144561 0.0444693 0.0801409 -0.0333894 -0.1111651 -0.0199746 -0.0268296 -0.0244721 0.0952545 -0.002411 -0.0270165 -0.0026305 0.1294569 unknown
polarizability: 221.4447458|2.3116664|132.2465742|13.9251146|-0.0822528|61.5470671 unknown
InChI: InChI=1S/C9H11NO2S/c1-6(11)10-8-4-3-7(13-2)5-9(8)12/h3-5,10,12H,1-2H3
charge 0 multiplicity 1
24 atoms
S  3.812056 1.212849 0.468616
O  -0.185676 -2.33605 0.136029
O  -3.19762 1.596313 -0.098333
N  -2.0407 -0.443256 -0.013158
C  -0.698552 0.001166 0.097913
C  0.300708 -1.006942 0.178747
C  -0.28492 1.356712 0.132884
C  2.066708 0.66442 0.326912
C  1.668307 -0.693055 0.291162
C  1.082571 1.680657 0.246721
C  -3.197949 0.328982 -0.104922
C  -4.480272 -0.497209 -0.216562
C  4.738622 -0.409512 0.627068
H  -1.044751 2.13758 0.071663
H  2.40278 -1.50478 0.34845
H  1.380713 2.734021 0.274899
H  -2.142409 -1.462788 -0.025558
H  -4.611655 -1.156312 0.661638
H  -4.470625 -1.131802 -1.122195
H  -5.335901 0.190595 -0.275063
H  0.548156 -2.993566 0.191993
H  4.6232 -1.020021 -0.282777
H  4.406498 -0.963645 1.51949
H  5.796813 -0.129557 0.744786
