program: Gaussian 09
title: 000194987
version: EM64L-G09RevD.01
frameworkgroup: C1[X(C22H28ClN3O3)]
method: RPBEPBE
basis: SDD
operation: Freq
keyword: #p
keyword: freq=noraman
keyword: PBEPBE/SDD
title: #p freq=noraman PBEPBE/SDD
converged: YES YES NO NO
title: Mulliken charges:
elementType: Cl O O O N N N C C C C C C C C C C C C C C C C C C C C C C H H H H H H H H H H H H H H H H H H H H H H H H H H H H
charge: -0.055240 -0.282159 -0.311660 -0.330946 -0.103344 -0.395680 -0.173600 -0.006180 -0.380247 -0.339070 -0.322086 -0.433257 -0.485833 0.448890 0.151052 -0.450340 -0.376603 0.125165 -0.220747 -0.228097 0.280901 -0.245763 -0.346262 0.599055 -0.495004 -0.369270 -0.637495 -0.661299 -0.526613 0.205117 0.221520 0.208029 0.190918 0.228936 0.208683 0.195842 0.234835 0.244551 0.193534 0.226146 0.378329 0.233080 0.263270 0.224341 0.224551 0.227087 0.304255 0.251948 0.259151 0.213641 0.236367 0.239262 0.208489 0.246628 0.225476 0.252730 0.225018
chargesum: 0.00000
title: Mulliken charges with hydrogens summed into heavy atoms:
elementType: Cl O O O N N N C C C C C C C C C C C C C C C C C C C C C C
charge: -0.055240 -0.282159 -0.311660 -0.330946 -0.103344 -0.017351 -0.173600 0.198937 0.049302 0.080783 0.082439 0.046129 -0.066153 0.448890 0.151052 -0.217259 -0.113333 0.125165 0.003594 -0.003546 0.280901 -0.018676 -0.042006 0.599055 -0.243056 -0.369270 0.071664 0.033079 0.176610
polarizability: 3.85160143e+02 4.97147660e+01 2.44359015e+02 -1.06105846e+01 1.36640228e+01 2.48614902e+02
1716.lowfreq: -5.0319 -1.5197 -0.0009 0.0010 0.0012 5.6587 10.3573 12.2320 27.1852
frequency: 9.3032 11.7683 27.1218 33.5579 35.5009 43.2891 55.1277 64.1902 69.9888 81.8612 94.2483 109.8411 137.5713 143.1537 159.0810 174.6273 183.5604 192.4006 209.1996 223.5340 231.0173 238.0097 247.9869 262.3567 277.2508 279.8614 298.0483 314.2190 327.4676 332.9791 341.6831 364.4468 383.0845 394.8328 405.7055 413.5379 446.4391 454.5881 461.7899 479.7708 490.7181 560.5478 574.5123 589.2200 614.5663 617.9960 627.8662 648.7532 657.8257 683.8123 700.9332 705.6895 742.7640 746.2060 768.6027 785.9317 793.4846 800.5254 817.8799 828.0540 860.5090 865.2746 880.2166 916.5637 926.1170 943.6563 960.1043 968.5256 975.7826 983.0012 989.5309 992.6171 1001.2507 1020.0776 1025.3582 1037.8509 1053.8777 1058.7839 1064.1261 1076.2675 1094.3224 1095.4464 1113.5968 1115.1149 1128.6052 1130.9851 1139.3654 1150.3930 1155.1028 1159.3322 1169.9785 1180.5051 1200.6217 1209.3683 1211.2595 1217.2921 1225.4575 1238.1413 1250.4227 1258.9090 1266.1837 1281.1479 1294.5780 1318.2801 1325.2118 1332.2336 1344.8271 1353.5626 1358.5092 1364.8919 1367.3259 1381.4671 1396.3391 1403.8925 1432.0489 1437.9582 1440.2180 1449.0744 1450.5815 1453.2233 1456.5004 1458.1086 1468.1983 1469.3579 1470.5297 1471.5692 1472.6073 1481.0969 1483.0419 1486.7266 1511.3817 1525.1394 1532.4121 1584.7439 1594.3420 1614.6986 1616.3641 2849.1023 2858.2920 2888.6554 2902.8752 2938.3221 2947.7845 2961.9349 2967.7882 2990.3517 2990.6226 3029.0211 3031.0284 3032.0607 3040.9514 3059.7405 3071.2649 3077.8131 3088.8698 3113.0817 3122.8093 3128.2167 3136.0061 3140.5353 3147.4913 3157.9114 3161.6328 3176.3569 3460.9859
redmass: 6.4838 5.3589 3.8524 4.8245 3.9745 4.6105 6.9064 4.1718 2.1380 2.6853 2.4166 4.5465 3.9273 4.1235 3.8722 3.1642 3.4964 3.4975 3.5846 2.5418 1.6122 2.2653 2.0512 2.8817 2.5514 3.0268 3.4413 2.7600 3.5631 5.0056 2.4236 3.0758 6.4540 3.2560 2.8483 3.1704 3.3754 3.1344 3.3755 4.2424 4.0032 5.3973 2.6126 4.8918 4.9422 5.3647 6.5707 5.1629 4.3296 5.5068 3.6819 2.1184 1.6066 4.5855 1.1909 2.8729 2.7532 3.4379 3.8047 1.9604 1.2479 3.3726 3.1789 1.3797 2.9093 1.3683 2.0789 2.4287 4.2959 1.3876 4.1917 1.9628 1.5057 3.1991 2.1631 2.9606 2.3200 1.4902 3.8005 1.6744 2.1346 1.2594 1.2922 2.7952 1.4932 2.4317 2.4629 1.8988 1.8809 1.6573 1.0596 1.1114 1.1702 2.8983 2.4653 3.3346 1.2602 2.0667 1.2693 1.3699 1.4557 1.3004 1.5056 1.3895 1.2191 5.1399 1.5535 1.4356 1.4232 1.3871 2.9108 3.5401 1.9273 3.3117 1.1349 1.2059 2.0363 1.0824 1.0944 1.3589 1.0933 1.1272 1.0552 1.0995 1.1526 1.0673 1.1052 1.0953 2.0768 1.2733 1.6941 2.4165 6.8945 6.9677 6.1586 6.1395 6.4776 1.0713 1.0697 1.0681 1.0526 1.0479 1.0822 1.0659 1.0322 1.0858 1.0670 1.0867 1.0834 1.0910 1.0892 1.1044 1.0964 1.0978 1.1009 1.0869 1.0863 1.1003 1.0915 1.0949 1.0955 1.0914 1.1014 1.0891 1.0795
irintensity: 2.1417 0.9809 0.3629 1.3725 0.3213 0.0896 4.4946 2.1625 4.2840 2.6419 1.0040 1.1998 1.3560 0.7066 3.3219 2.8691 5.9397 0.3472 0.0880 2.2944 5.2175 0.3502 3.6194 0.4279 14.9493 1.8444 9.1791 3.5566 14.7217 3.7956 1.5291 8.9121 2.6823 14.2095 0.4635 0.4910 8.1604 7.9490 4.6404 7.6451 8.9000 0.6577 5.1356 2.3168 8.2952 6.7942 20.4635 15.2808 12.8273 1.3580 4.4315 35.5494 50.3190 4.3669 126.7909 28.4958 25.7282 18.9535 4.7921 35.4619 0.2341 29.9005 2.3049 4.3150 20.7262 15.9096 0.3233 18.8350 83.5341 0.1102 0.8979 2.3084 8.8609 15.9419 15.9021 63.4580 28.5656 19.0204 15.8906 13.4591 15.9281 7.3494 8.0699 131.0850 24.0579 46.8459 24.5222 18.9645 21.9596 4.7802 0.4308 1.6739 7.1539 4.1712 4.0247 94.1264 2.0636 257.2680 2.0201 27.7867 19.8386 12.0856 42.2166 6.9304 10.9941 83.6107 10.6775 6.6341 1.2546 8.4623 40.5945 2.3102 17.8256 14.8051 6.5525 10.4286 14.1081 1.5210 3.9324 87.2995 28.2236 11.1746 8.3786 49.3495 18.7494 49.3777 43.1501 48.1788 10.4532 38.0719 431.9623 43.5838 5.4443 293.5278 1.2589 12.9876 231.9234 34.3634 80.5774 103.6854 103.3997 156.7086 43.4380 85.2194 55.5225 19.8770 75.2350 69.9618 8.7408 28.1774 34.3100 39.8374 13.6827 34.7646 24.5395 8.6440 0.2136 15.7527 20.5742 7.0580 32.4073 8.4517 28.2407 7.7660 99.7430
temp: 298.150 k
press: 1.00000 atm
elementType: 17 8 8 8 7 7 7 6 6 6 6 6 6 6 6 6 6 6 6 6 6 6 6 6 6 6 6 6 6 1 1 1 1 1 1 1 1 1 1 1 1 1 1 1 1 1 1 1 1 1 1 1 1 1 1 1 1
symmnumber: 1
zpe: 1222783.8 jmol-1
zpe.correction: 0.465734 hartree
zpe.thermalcorrener: 0.494682 hartree
zpe.thermalcorrenthalpy: 0.495626 hartree
zpe.thermalcorrgfe: 0.401855 hartree
zpe.sumelectzpe: -1702.925946 hartree
zpe.sumelectthermal: -1702.896998 hartree
zpe.sumelectthermalent: -1702.896054 hartree
zpe.sumelectthermalfe: -1702.989824 hartree
dipole: 0.5765 2.0024 7.4800
dipole: 7.7648
quadrupole: -153.3702 -177.4449 -177.0540
quadrupole: 7.7639 21.4394 2.0428
quadrupole: 15.9195 -8.1552 -7.7643 7.7639 21.4394 2.0428
hfenergy: -1703.3916793 hartree
pointgroup: C01 [X(C22H28Cl1N3O3)]
dipole: -0.1505565 2.2937629 -2.0120858 debye
polarizability: 376.7084383|-43.9380362|263.6222709|-42.2738392|-3.0894731|237.8033508 unknown
InChI: InChI=1S/C22H28ClN3O3/c1-25(2)20-12-21(28-3)18(11-19(20)23)22(27)24-13-17-15-26(9-10-29-17)14-16-7-5-4-6-8-16/h4-8,11-12,17,24H,9-10,13-15H2,1-3H3
charge 0 multiplicity 1
57 atoms
Cl -5.716559 0.24676 3.169669
O  1.619533 -1.353599 -1.981373
O  -1.647228 -2.556699 1.504272
O  -2.016793 0.342205 -1.60138
N  3.383267 -0.596859 0.18616
N  -0.791668 -1.786294 -0.519221
N  -5.971116 2.206661 0.661699
C  1.667423 -2.141476 -0.724314
C  2.073817 -1.245051 0.459504
C  3.318357 0.203883 -1.06089
C  2.917036 -0.702464 -2.232608
C  0.280021 -2.781692 -0.574356
C  3.878997 0.183595 1.34481
C  5.350801 0.567075 1.2208
C  -1.696189 -1.738608 0.522287
C  5.803387 1.840631 1.644106
C  6.296484 -0.363379 0.719032
C  -2.766326 -0.677029 0.461456
C  7.175276 2.178806 1.578228
C  7.666109 -0.027715 0.647951
C  -2.93913 0.330811 -0.53429
C  8.111796 1.244594 1.07998
C  -3.690121 -0.671763 1.536019
C  -4.942091 1.250478 0.615634
C  -4.001245 1.25543 -0.460687
C  -4.726752 0.259498 1.624585
C  -7.371554 1.833243 0.950543
C  -5.837368 3.446478 -0.113145
C  -2.127198 1.374021 -2.63292
H  2.428721 -2.945013 -0.841893
H  2.165749 -1.869405 1.367969
H  1.265596 -0.49425 0.638055
H  2.578843 1.040384 -0.96902
H  4.312346 0.645741 -1.257086
H  2.781802 -0.123424 -3.161514
H  3.698333 -1.477109 -2.386151
H  0.121934 -3.460356 -1.435335
H  0.227193 -3.379679 0.352288
H  3.270447 1.107697 1.519281
H  3.743585 -0.453309 2.242432
H  -0.863816 -1.088879 -1.269074
H  5.07968 2.571608 2.026944
H  5.935935 -1.340214 0.377763
H  7.510436 3.168166 1.910175
H  8.387097 -0.756103 0.258815
H  9.17506 1.504748 1.026134
H  -3.529654 -1.419246 2.319703
H  -4.1492 1.975968 -1.267768
H  -7.430206 0.817339 1.361949
H  -7.975918 1.865807 0.017961
H  -7.820952 2.528164 1.684044
H  -6.527852 4.199925 0.306157
H  -6.090278 3.324241 -1.192169
H  -4.811365 3.84344 -0.032062
H  -2.040843 2.386282 -2.194384
H  -1.28248 1.18817 -3.312214
H  -3.079958 1.282267 -3.188248
