program: Gaussian 09
title: 000194906
version: EM64L-G09RevD.01
frameworkgroup: C1[X(C18H23N3O4)]
method: RPBEPBE
basis: SDD
operation: Freq
keyword: #p
keyword: freq=noraman
keyword: PBEPBE/SDD
title: #p freq=noraman PBEPBE/SDD
converged: YES YES NO NO
title: Mulliken charges:
elementType: O O O O N N N C C C C C C C C C C C C C C C C C C H H H H H H H H H H H H H H H H H H H H H H H
charge: -0.257347 -0.263586 -0.276898 -0.332191 -0.483829 -0.382205 -0.651194 0.295449 -0.269061 0.088855 -0.125436 0.126710 -0.389865 0.012890 -0.510185 0.434569 -0.432807 -0.551410 -0.441900 -0.254145 0.295547 0.236777 -0.672424 -0.227960 -0.675433 0.281701 0.228714 0.240006 0.204594 0.305675 0.220837 0.264193 0.358496 0.288281 0.221870 0.190111 0.225445 0.221381 0.232954 0.215785 0.211621 0.331803 0.311984 0.227147 0.243745 0.217248 0.226652 0.236836
chargesum: 0.00000
title: Mulliken charges with hydrogens summed into heavy atoms:
elementType: O O O O N N N C C C C C C C C C C C C C C C C C C
charge: -0.257347 -0.263586 -0.276898 -0.332191 -0.178154 -0.023709 -0.007408 0.295449 0.012640 0.088855 0.103278 0.126710 0.054736 0.012890 -0.025155 0.434569 -0.144526 -0.139429 -0.216455 -0.032764 0.295547 0.236777 -0.012063 0.242932 0.005303
polarizability: 2.51349517e+02 -2.41246003e+00 2.24864258e+02 -1.26997459e+01 -2.90384183e+01 1.94917087e+02
1716.lowfreq: -5.4839 0.0004 0.0007 0.0008 7.2860 8.5645 15.6800 23.5535 35.5082
frequency: 15.1079 23.5087 35.4899 46.0287 51.1135 59.9417 69.1559 71.6710 83.0005 110.5603 125.0903 146.1482 157.7706 165.3739 186.6686 206.0980 213.5184 230.5391 242.4632 260.9728 268.9284 284.4813 333.6331 350.8072 365.8605 371.6224 386.3609 399.5399 423.2418 460.0472 464.8364 478.7788 483.1700 503.0237 532.0515 557.4286 562.4192 576.5002 598.5384 606.7814 624.0229 651.9001 693.8188 710.4367 718.4106 745.4091 760.7511 780.2415 785.6571 795.7916 803.8941 807.1990 816.5341 835.2760 852.0164 886.4446 910.7025 920.3130 945.8460 964.4837 980.3476 981.0954 995.8049 1014.3057 1024.1767 1027.7826 1036.4083 1054.7363 1060.9925 1071.9721 1107.4614 1112.5293 1121.9377 1136.2183 1138.1037 1174.2430 1177.5675 1214.9190 1217.5501 1232.0277 1238.5681 1243.0852 1250.3982 1252.0624 1264.8129 1269.6913 1297.2313 1312.1563 1317.9907 1340.7378 1349.2688 1354.2401 1360.7881 1376.8482 1391.4314 1399.5967 1400.7533 1426.0634 1437.8414 1450.7684 1461.3495 1464.6936 1471.6380 1473.1642 1477.9254 1485.1307 1489.4337 1493.5308 1511.9414 1585.3686 1597.9751 1600.2604 1623.2401 1627.6675 1634.1501 2914.2242 2954.8857 2979.6165 2980.1722 2994.9974 3012.9850 3030.4249 3031.0594 3036.8525 3074.0584 3074.1361 3085.2899 3092.1970 3100.3057 3101.7039 3106.8878 3114.7369 3135.4561 3155.2573 3430.3363 3542.1004 3608.3825 3704.3470
redmass: 4.1988 4.9583 5.3222 3.7756 2.6254 3.1093 4.4132 4.9063 4.2470 5.0805 4.0432 3.9424 3.3374 3.0800 3.3888 1.6224 5.1869 3.1965 3.9481 1.6340 2.2708 3.3109 4.5194 3.2234 1.8702 3.3466 1.7793 2.7591 4.0950 1.3875 1.0892 3.1210 3.4702 3.0397 4.4392 4.1800 3.9902 4.7386 4.7608 4.4598 5.0936 5.2659 6.0590 1.6992 3.6752 4.1635 2.1094 1.4772 2.8583 2.7977 1.2096 2.0171 3.4177 4.8865 3.8960 3.5774 1.3765 3.1283 3.0542 2.7336 1.3314 2.5590 2.6942 2.9385 2.5188 2.2349 2.0396 2.6919 2.2513 1.9585 1.7937 2.2591 2.1774 2.5902 1.6324 1.8823 1.4394 1.4320 1.4137 1.6974 1.4016 2.0767 1.2985 1.1505 1.5535 1.4548 1.4083 1.7662 1.5625 1.4249 1.5953 1.8844 1.4626 2.1393 1.2159 3.2674 1.2662 3.6285 1.1668 1.1692 3.6416 1.0403 1.0528 1.0622 1.0753 1.0690 1.5238 1.8030 2.1778 8.2724 1.6618 3.5470 7.5317 8.2986 3.0328 1.0833 1.0663 1.0362 1.0661 1.0357 1.0584 1.0944 1.0589 1.0840 1.1038 1.1022 1.1004 1.0985 1.0989 1.1038 1.1035 1.0877 1.0908 1.0991 1.0798 1.0455 1.0801 1.1041
irintensity: 0.8996 0.3251 0.2471 1.8400 0.4654 3.8966 8.3083 4.8855 8.1917 1.2418 1.1339 3.7786 2.7269 3.6533 5.2151 3.1713 4.5768 0.9561 1.1787 2.0759 3.4394 3.4897 14.5933 4.4328 43.0364 3.5327 83.3937 0.4297 4.1408 63.4444 164.2585 2.3515 6.4579 39.7424 2.4383 10.1513 0.8249 6.6001 5.0046 11.6609 0.9826 0.6210 4.2194 200.6010 1.6512 10.8230 29.6409 10.4399 5.2408 3.4432 9.4950 27.3121 5.2509 14.8995 2.9612 4.0562 0.5709 31.6427 10.6482 7.7781 2.2047 6.2272 4.1527 19.2140 23.2967 38.3487 8.0340 47.5853 1.5603 11.2127 9.5334 24.8719 209.8154 26.5739 12.9820 23.9364 7.1107 22.8394 32.7374 19.2171 7.7508 7.4501 32.5377 4.2609 6.1229 2.1989 31.3054 21.3587 4.7667 57.1830 26.2182 149.9665 11.3807 15.3884 14.9314 12.4967 19.5183 24.0482 9.2854 14.4060 25.4867 9.7396 7.2386 2.6551 4.9108 13.5953 7.5610 10.2786 460.1415 0.8166 76.6060 11.8018 37.5139 96.5876 264.6745 67.7586 45.5286 33.4226 71.0058 16.3358 15.0422 12.0387 15.0290 13.3214 27.5975 39.4353 31.3118 24.5089 26.5168 5.3841 47.2523 14.4532 9.4902 22.9631 156.6261 34.9580 37.4342 36.6158
temp: 298.150 k
press: 1.00000 atm
elementType: 8 8 8 8 7 7 7 6 6 6 6 6 6 6 6 6 6 6 6 6 6 6 6 6 6 1 1 1 1 1 1 1 1 1 1 1 1 1 1 1 1 1 1 1 1 1 1 1
symmnumber: 1
zpe: 1025138.8 jmol-1
zpe.correction: 0.390455 hartree
zpe.thermalcorrener: 0.415211 hartree
zpe.thermalcorrenthalpy: 0.416155 hartree
zpe.thermalcorrgfe: 0.333969 hartree
zpe.sumelectzpe: -1163.047696 hartree
zpe.sumelectthermal: -1163.022940 hartree
zpe.sumelectthermalent: -1163.021996 hartree
zpe.sumelectthermalfe: -1163.104182 hartree
dipole: -3.0353 5.7728 0.6128
dipole: 6.5509
quadrupole: -142.1922 -154.0843 -132.6870
quadrupole: 1.1066 4.9977 1.2922
quadrupole: 0.7956 -11.0965 10.3009 1.1066 4.9977 1.2922
hfenergy: -1163.4381503 hartree
pointgroup: C01 [X(C18H23N3O4)]
dipole: 1.1825143 2.2831007 -0.1779276 debye
polarizability: 251.7762596|2.2703289|223.8442381|-11.8026698|29.5220791|195.5103644 unknown
InChI: InChI=1S/C18H23N3O4/c1-3-10-6-5-7-11-15-12(20-18(19)23)9-25-13(8-14(22)24-4-2)17(15)21-16(10)11/h5-7,12-13,20-21H,3-4,8-9,19H2,1-2H3
charge 0 multiplicity 1
48 atoms
O  -2.171035 0.934229 2.202488
O  -0.014922 2.899005 -0.954361
O  -2.146684 1.98903 -0.772099
O  -2.599347 -3.085052 -0.988958
N  1.444614 0.576511 1.067232
N  -2.658122 -0.900837 -0.132147
N  -3.612703 -1.378471 -2.22057
C  -0.369386 -0.788964 0.833923
C  -1.804204 -1.233729 1.023995
C  0.078672 0.421944 1.353088
C  -0.790018 1.438815 2.048878
C  0.751883 -1.416891 0.164789
C  -2.322149 -0.538086 2.299106
C  1.880457 -0.53767 0.325698
C  -0.940486 2.774086 1.251135
C  3.163262 -0.82182 -0.208338
C  0.90196 -2.625355 -0.565995
C  4.349804 0.105747 0.010118
C  3.273748 -2.033265 -0.927482
C  2.168742 -2.918604 -1.104832
C  -1.141929 2.515862 -0.232967
C  -2.931328 -1.858385 -1.100921
C  4.954083 -0.008011 1.437101
C  -0.016343 2.578626 -2.420283
C  1.397178 2.8387 -2.928941
H  -1.860568 -2.330952 1.145514
H  -0.38887 1.693436 3.056028
H  -3.407651 -0.679507 2.420325
H  -1.783739 -0.924064 3.188626
H  2.004265 1.402698 1.265883
H  -0.048039 3.405767 1.393629
H  -1.824054 3.292658 1.66214
H  -2.772684 0.101935 -0.330965
H  0.041559 -3.286423 -0.719823
H  5.136658 -0.128952 -0.730608
H  4.056259 1.160673 -0.177489
H  4.24483 -2.296404 -1.36588
H  2.312944 -3.83993 -1.680109
H  5.320931 -1.03341 1.619805
H  5.80126 0.690809 1.566031
H  4.201829 0.214996 2.216167
H  -3.850493 -2.053254 -2.941778
H  -3.897795 -0.406502 -2.321515
H  -0.770605 3.223182 -2.906928
H  -0.323486 1.524718 -2.540288
H  1.443678 2.638714 -4.014814
H  1.696523 3.886739 -2.756119
H  2.121699 2.17466 -2.42679
