program: Gaussian 09
title: 000194893
version: EM64L-G09RevD.01
frameworkgroup: C1[X(C20H30O2)]
method: RPBEPBE
basis: SDD
operation: Freq
keyword: #pfreq=noraman
keyword: PBEPBE/SDD
title: #p freq=noraman PBEPBE/SDD
converged: YES YES NO NO
title: Mulliken charges:
elementType: O O C C C C C C C C C C C C C C C C C C C C H H H H H H H H H H H H H H H H H H H H H H H H H H H H H H
charge: -0.417867 -0.244881 -0.393011 -0.376101 -0.450576 -0.443055 -0.451575 -0.467837 -0.192918 -0.180622 -0.546285 -0.534253 -0.170056 -0.159439 -0.532378 -0.168178 -0.052799 -0.155785 -0.163179 -0.167680 0.188667 -0.595921 0.197971 0.197855 0.254223 0.211256 0.220068 0.197351 0.196050 0.208951 0.193200 0.224466 0.247107 0.244096 0.225315 0.218733 0.205837 0.205836 0.208989 0.204759 0.236144 0.223820 0.207443 0.204972 0.234979 0.219814 0.210346 0.220413 0.220046 0.246403 0.215155 0.374131
chargesum: 0.00000
title: Mulliken charges with hydrogens summed into heavy atoms:
elementType: O O C C C C C C C C C C C C C C C C C C C C
charge: -0.043736 -0.244881 0.002815 0.089377 -0.033158 -0.038054 -0.033909 0.023365 0.032397 0.038112 -0.134611 -0.120505 0.066088 0.064381 -0.119962 0.066801 0.157547 0.064029 0.057234 0.052365 0.188667 -0.134363
polarizability: 2.64638875e+02 9.16086583e+00 2.28317839e+02 -1.28583942e+00 -5.76570355e+00 1.87517984e+02
1716.lowfreq: -4.6920 -0.0001 0.0004 0.0005 3.7090 5.5006 10.4808 14.5697 20.1583
frequency: 9.7809 13.7435 20.1356 29.4634 33.3550 38.2004 41.1866 54.4021 66.6478 80.6361 86.0816 95.6790 101.7958 115.3497 133.4217 147.2127 161.0174 177.0851 184.0309 211.5454 225.0890 242.5065 261.7095 267.9401 289.0282 314.9174 353.9233 359.6636 383.0636 415.1097 430.0793 442.1780 448.2539 482.1609 502.2194 509.6337 534.9901 552.4934 607.8951 637.7294 673.9716 739.9981 757.2654 780.4386 793.4932 813.3278 828.6692 840.5588 849.5044 858.5081 865.2117 880.3625 904.2101 930.7960 940.2940 959.6262 964.0733 974.1862 975.7124 980.6585 988.7918 996.1836 1009.2329 1015.2480 1022.8424 1030.3284 1040.7323 1049.3522 1053.2244 1066.7855 1074.2864 1080.1886 1093.5934 1100.3347 1117.2877 1126.7140 1135.3123 1159.9742 1180.1372 1194.2379 1202.9921 1215.1194 1230.1416 1245.9259 1251.0924 1253.3484 1254.5599 1266.3689 1274.9304 1282.3369 1283.7436 1285.0712 1288.5914 1291.9022 1297.3035 1298.7327 1309.3958 1314.8222 1319.9336 1333.7317 1340.8572 1341.7946 1348.9820 1359.6563 1433.0545 1443.6337 1451.8174 1454.9467 1456.2297 1457.5937 1459.4747 1461.4278 1465.7956 1477.3164 1652.9976 1658.8055 1670.8517 1679.5006 1684.4444 1688.4608 2940.0060 2952.7131 2954.2924 2954.7393 2958.6139 2967.6511 2974.4963 2981.3053 2995.7281 3016.3447 3018.8620 3024.5946 3030.9865 3031.9171 3035.1383 3036.2123 3060.7994 3061.1055 3061.6696 3068.0242 3069.7542 3073.0226 3079.3801 3080.0195 3081.5534 3083.6617 3085.1006 3088.6014 3186.6640 3502.3307
redmass: 5.5579 4.8235 5.6562 5.8652 4.6938 4.3127 3.4956 4.4193 3.0717 3.4982 2.3451 3.1825 2.8101 2.0049 2.2097 2.0650 2.3882 2.5676 2.6771 2.7511 3.9612 3.3745 2.7235 2.3581 2.3332 3.8564 2.9898 1.9655 3.3474 2.2818 1.9634 2.7502 2.5721 2.2512 2.5754 2.5249 2.9828 2.3820 2.2703 1.4331 1.6939 1.1694 1.5160 1.6098 1.6087 1.7403 1.8957 1.6674 2.4703 3.1337 1.9245 2.0843 1.9765 1.9410 1.4641 1.2837 1.2136 1.1852 1.1420 1.1435 1.5726 1.6672 1.2826 1.7862 3.2038 3.3215 3.0410 1.9217 2.6523 2.2392 2.3482 1.9683 2.5936 2.3771 1.9893 1.5790 1.2858 1.6048 1.5034 1.3371 1.2629 1.4484 1.3068 1.2658 1.2595 1.2517 1.2617 1.2842 1.2753 1.2228 1.2241 1.2829 1.2665 1.2801 1.2468 1.1927 1.3179 1.3571 1.3274 1.3526 1.3956 1.5182 1.4197 1.6787 1.1695 1.0957 1.0911 1.0915 1.0957 1.1019 1.0970 1.0850 1.0924 1.0965 4.6632 7.9841 6.6977 6.4039 6.4010 6.6285 1.0654 1.0640 1.0619 1.0613 1.0628 1.0585 1.0621 1.0649 1.0657 1.1001 1.0939 1.1001 1.0938 1.0943 1.0943 1.0971 1.0936 1.0897 1.0865 1.0937 1.0929 1.0908 1.0886 1.0757 1.0896 1.0887 1.0976 1.0884 1.1152 1.0637
irintensity: 0.7842 0.4403 0.1826 0.6767 0.3649 0.0946 0.9043 0.8371 0.3184 0.2204 0.1376 0.3102 0.5231 0.0381 0.6070 0.1630 0.2060 0.0189 0.5974 0.0710 0.2683 0.6629 3.9959 0.3211 5.5554 4.1862 3.2441 0.8644 9.5312 5.1077 0.2024 10.4336 2.7727 5.0012 3.2273 0.5753 19.0142 25.0161 48.3852 20.4061 91.7384 23.8682 4.0219 2.1508 1.6738 1.9649 1.2239 1.5713 2.3815 10.6018 0.2465 3.5996 2.9479 1.5202 4.8862 150.2319 12.1766 36.8834 36.7794 89.6117 8.0644 32.1968 1.6408 9.7357 124.2819 12.0123 36.0715 24.6343 25.9973 82.0894 20.7159 4.8754 8.2893 4.4775 20.4661 21.9145 13.0433 0.9670 1.5074 1.0648 2.6721 0.5101 2.6771 0.7963 6.6037 5.1575 3.6035 2.8046 7.8735 0.0850 0.6377 1.4372 2.6518 1.6798 0.7342 1.6894 3.6258 13.7570 1.9552 2.0220 8.1890 14.9962 0.3525 42.0300 6.9600 10.2108 14.6471 13.3968 12.5840 6.0117 20.6140 1.8814 3.4159 23.1545 20.3926 187.2293 0.5170 0.6870 0.5152 0.1646 43.2712 49.7728 10.7761 33.4950 53.8880 44.0383 71.5836 4.0825 26.1153 16.0817 22.5341 15.6353 26.0071 13.0172 1.7770 23.5748 5.1176 16.8805 61.0636 13.0769 4.4306 14.1855 2.7436 1.2318 30.1534 68.5374 56.6651 75.0070 15.7518 20.6586
temp: 298.150 k
press: 1.00000 atm
elementType: 8 8 6 6 6 6 6 6 6 6 6 6 6 6 6 6 6 6 6 6 6 6 1 1 1 1 1 1 1 1 1 1 1 1 1 1 1 1 1 1 1 1 1 1 1 1 1 1 1 1 1 1
symmnumber: 1
zpe: 1171443.0 jmol-1
zpe.correction: 0.446179 hartree
zpe.thermalcorrener: 0.472726 hartree
zpe.thermalcorrenthalpy: 0.473671 hartree
zpe.thermalcorrgfe: 0.383168 hartree
zpe.sumelectzpe: -928.770947 hartree
zpe.sumelectthermal: -928.744399 hartree
zpe.sumelectthermalent: -928.743455 hartree
zpe.sumelectthermalfe: -928.833957 hartree
dipole: -0.5073 -0.0635 1.4403
dipole: 1.5283
quadrupole: -126.1235 -131.8590 -134.7134
quadrupole: 2.0694 3.4266 -2.5612
quadrupole: 4.7752 -0.9604 -3.8148 2.0694 3.4266 -2.5612
hfenergy: -929.2171256 hartree
pointgroup: C01 [X(C20H30O2)]
dipole: 0.1924955 -0.0229208 -0.5691734 debye
polarizability: 262.8932564|-11.8918306|229.62132|-1.7762702|7.295094|187.9601218 unknown
InChI: InChI=1S/C20H30O2/c1-2-3-4-5-6-7-8-9-10-11-12-13-14-15-16-17-18-19-20(21)22/h2,6-7,9-10,12-13,15-16,21H,1,3-5,8,11,14,17-19H2
charge 0 multiplicity 1
52 atoms
O  6.181284 -1.655766 0.816486
O  4.170496 -1.414447 1.944851
C  -1.394331 -3.479812 -1.848825
C  3.574678 0.830755 0.041881
C  -2.298601 -3.761567 -0.616326
C  2.967985 1.471252 -1.234168
C  -0.479202 -2.234587 -1.678523
C  4.440309 -0.40432 -0.300867
C  2.105857 2.676455 -0.920654
C  -3.354302 -2.695546 -0.398774
C  -0.131526 3.915177 -0.77611
C  -4.586114 -0.913259 0.959674
C  0.765697 2.740262 -1.136004
C  -3.520914 -1.978101 0.742414
C  -3.483901 2.907715 1.113953
C  -1.14787 3.513028 0.282983
C  0.59327 -2.427056 -0.624114
C  -3.984861 0.419239 1.379418
C  -2.484511 3.393348 0.074212
C  -4.123612 1.588266 0.703622
C  4.865066 -1.177868 0.930014
C  0.786543 -1.628957 0.457785
H  -0.764606 -4.371003 -2.047734
H  -2.033489 -3.338881 -2.744146
H  2.759467 0.52272 0.719893
H  4.185416 1.577292 0.586867
H  -1.670002 -3.855954 0.289706
H  -2.794512 -4.743183 -0.769834
H  3.792927 1.761569 -1.919137
H  2.360277 0.709929 -1.762273
H  0.005113 -2.025969 -2.656151
H  -1.096812 -1.35186 -1.425429
H  3.83574 -1.096649 -0.922719
H  5.33447 -0.132664 -0.887107
H  2.616281 3.541534 -0.46618
H  -4.029066 -2.503652 -1.25012
H  0.493321 4.754614 -0.411445
H  -0.668842 4.271946 -1.677719
H  -5.281365 -1.259048 1.756016
H  -5.188844 -0.787131 0.040461
H  0.252479 1.868444 -1.571773
H  -2.838363 -2.159698 1.588069
H  -4.277997 3.67373 1.24411
H  -2.980802 2.791786 2.092269
H  -0.732281 3.256839 1.269782
H  -3.379119 0.40478 2.299986
H  1.253172 -3.299354 -0.768512
H  -2.893171 3.629317 -0.921725
H  -4.714818 1.603085 -0.225972
H  1.588795 -1.813249 1.182664
H  0.138354 -0.761156 0.640007
H  6.406541 -2.181646 1.632621
