program: Gaussian 09
title: 000194862
version: EM64L-G09RevD.01
frameworkgroup: C1[X(C26H28FNO)]
method: RPBEPBE
basis: SDD
operation: Freq
keyword: #p
keyword: freq=noraman
keyword: PBEPBE/SDD
title: #p freq=noraman PBEPBE/SDD
converged: YES YES NO NO
title: Mulliken charges:
elementType: F O N C C C C C C C C C C C C C C C C C C C C C C C C C C H H H H H H H H H H H H H H H H H H H H H H H H H H H H
charge: -0.207326 -0.263919 -0.110760 -0.403525 -0.328817 -0.324942 -0.295519 -0.669357 -0.670895 0.292017 0.341829 0.278043 -0.388145 -0.388131 -0.362751 -0.393095 0.234738 -0.476020 0.415194 -0.366023 -0.361227 -0.372193 -0.368081 -0.370972 -0.407207 0.307808 -0.239199 -0.245963 -0.249199 0.217021 0.223052 0.206325 0.193177 0.205893 0.190695 0.226004 0.207049 0.209162 0.225381 0.208744 0.210478 0.227034 0.208498 0.251211 0.247994 0.250782 0.249103 0.223900 0.263047 0.269189 0.255096 0.256031 0.257012 0.231375 0.226760 0.225195 0.228429
chargesum: 0.00000
title: Mulliken charges with hydrogens summed into heavy atoms:
elementType: F O N C C C C C C C C C C C C C C C C C C C C C C C C C C
charge: -0.207326 -0.263919 -0.110760 0.036548 0.070685 0.071646 0.137533 -0.026070 -0.024885 0.292017 0.341829 0.278043 -0.136934 -0.140137 -0.111970 -0.143992 0.234738 -0.252120 0.415194 -0.102976 -0.092038 -0.117097 -0.112050 -0.113960 -0.175832 0.307808 -0.012439 -0.020768 -0.020770
polarizability: 4.92870311e+02 -2.69360906e+01 3.12215707e+02 1.60010725e+01 -8.82748085e+00 1.96230044e+02
1716.lowfreq: -8.6061 -3.2124 -1.9817 -0.0008 0.0010 0.0011 10.6647 18.1767 24.9644
frequency: 10.5307 18.0941 24.9557 33.4279 35.9664 39.5824 51.3950 55.6462 69.2334 77.2218 87.9204 89.2814 132.5748 144.3593 148.1034 153.8434 171.0197 177.6503 210.7328 220.6258 242.3489 259.9880 272.2833 290.7636 318.1646 326.2963 345.3977 355.0143 382.1177 390.2396 404.7776 412.9460 418.2962 436.7083 467.4162 481.6190 495.9705 499.8998 518.5915 530.7507 568.2753 610.0935 613.7323 627.6499 629.0410 647.5203 672.9079 698.6506 730.1700 734.5866 741.2361 762.6600 786.9980 796.2644 797.4829 802.0859 810.8251 819.1730 821.1687 827.6562 837.3430 843.0070 848.8411 879.9780 914.0452 915.8853 934.0464 951.2470 953.0934 964.4525 967.1467 970.5883 977.0478 986.9408 991.2709 994.2470 1001.3042 1006.3075 1026.7135 1062.5543 1063.7229 1077.1041 1083.9116 1085.4098 1094.4685 1103.0399 1120.5714 1123.6918 1140.0942 1156.4767 1162.5042 1171.7378 1180.7895 1191.6496 1199.2399 1207.6576 1226.8707 1232.2448 1236.6387 1265.3016 1279.1708 1289.1776 1292.2967 1293.2995 1305.1521 1322.0728 1329.5038 1346.7557 1358.3079 1362.9946 1367.0055 1372.1094 1388.0219 1388.7895 1390.2244 1393.4192 1402.4508 1424.7361 1437.2724 1460.9796 1462.9100 1471.3770 1471.8696 1479.7378 1482.2057 1485.0180 1488.0054 1492.0446 1493.8289 1499.2048 1565.1041 1575.6384 1587.9712 1598.6621 1604.7460 1609.5085 1619.0355 2857.3025 2866.0621 2915.4611 2967.6846 2980.3676 2984.7266 3017.7553 3032.9687 3035.7282 3063.9147 3073.1977 3076.9789 3089.6860 3090.7029 3091.9463 3115.0058 3126.2949 3135.3675 3139.1282 3139.6041 3145.8890 3152.3385 3156.0980 3163.1590 3166.9918 3167.9744 3173.4828 3177.3652
redmass: 4.3114 3.7150 5.2315 4.2409 4.9589 4.2435 4.3131 3.7061 4.1063 3.8579 2.6345 2.1868 3.5504 3.1467 3.8722 5.0417 4.6601 1.7062 2.2329 1.8467 3.0214 3.0942 3.2210 2.1324 3.5134 3.9511 4.9322 5.2143 4.0785 3.9182 2.8483 2.9757 3.0138 3.0177 3.3878 3.5027 3.6463 3.1608 3.0983 4.0077 4.4180 4.8935 6.3520 6.2737 6.5281 4.8007 4.8519 1.7160 4.0599 3.7852 3.1939 1.8749 2.0319 1.5570 1.1315 2.8384 1.6892 1.7972 1.7235 1.3157 1.6522 1.8317 1.3313 1.4546 2.1835 1.8800 2.0005 1.3518 1.5315 1.3684 1.6929 3.4563 1.3877 6.0742 2.2484 1.3201 2.6538 2.7235 2.1954 1.8303 2.3638 1.9568 1.6438 2.0810 2.8161 1.3279 1.3503 1.7089 2.8812 1.5947 1.4003 1.0570 1.3242 1.1152 2.0136 2.2386 2.2491 2.2402 1.7347 3.2560 1.1222 1.1997 1.2664 1.2443 1.3165 1.6190 1.3435 2.4619 5.5964 1.3450 1.4529 3.4707 1.6453 1.2389 1.3421 2.0207 3.7220 3.8163 2.2874 1.0619 1.0524 1.0661 1.0918 2.1439 1.0692 1.0908 1.0907 2.4812 1.1056 2.3469 6.8345 6.0486 7.4744 6.8339 6.3159 6.3416 6.4516 1.0720 1.0714 1.0702 1.0565 1.0360 1.0358 1.0881 1.1012 1.0884 1.0959 1.0980 1.0983 1.0874 1.1003 1.1003 1.0868 1.0867 1.0882 1.0881 1.0928 1.0892 1.0891 1.0962 1.0950 1.0956 1.0992 1.0961 1.0972
irintensity: 0.0821 0.1228 0.0597 0.0656 0.0559 0.1087 0.2560 0.1416 0.2042 0.0886 0.0730 0.3440 0.3923 1.0410 1.8213 0.3849 0.2499 0.7781 1.0986 0.1435 4.1089 1.4561 0.8482 1.4744 2.4524 0.8912 1.8009 0.7720 0.7486 7.0033 0.6122 0.0065 0.7225 2.7764 1.1800 5.3288 10.9879 9.5290 17.8324 37.1347 28.4386 3.2351 0.9409 5.0765 7.5833 1.6103 2.0242 51.1155 7.1332 4.2444 10.9119 47.5650 6.8991 19.8704 4.8647 3.3905 4.7371 9.4538 9.0900 5.7594 91.7620 23.5685 5.8387 12.4359 3.2045 0.3920 17.7072 1.5201 3.2070 2.0515 30.7175 133.2287 0.2068 0.1295 6.5993 0.8372 9.2090 11.0249 8.2829 33.3858 29.9847 22.5011 6.7173 2.6237 15.7543 11.7459 10.2792 7.6583 9.4685 56.4370 16.7875 0.0376 199.8699 1.2328 44.8034 43.1159 114.5739 183.4234 55.0867 42.3897 0.3901 8.0516 1.9113 29.4832 0.7670 13.6590 3.7979 14.0911 8.6940 1.7922 5.0510 5.6557 15.5878 19.7562 15.1708 13.3901 2.3889 11.8722 11.5178 2.8086 13.5369 2.4861 37.8789 1.3629 22.8285 17.8816 30.6874 78.7698 6.7109 157.1589 35.0496 2.4121 2.2588 84.6250 27.8543 6.1579 98.5866 32.0481 188.5568 70.2278 44.1978 29.0199 31.5190 23.6572 17.4131 15.3117 39.5772 63.8059 67.6287 26.0563 30.9645 54.9044 11.0577 0.1885 6.6252 15.8220 25.7299 5.2973 5.7852 43.3151 13.7140 13.9092 15.5409 5.0719 2.4559
temp: 298.150 k
press: 1.00000 atm
elementType: 9 8 7 6 6 6 6 6 6 6 6 6 6 6 6 6 6 6 6 6 6 6 6 6 6 6 6 6 6 1 1 1 1 1 1 1 1 1 1 1 1 1 1 1 1 1 1 1 1 1 1 1 1 1 1 1 1
symmnumber: 1
zpe: 1230615.9 jmol-1
zpe.correction: 0.468717 hartree
zpe.thermalcorrener: 0.496740 hartree
zpe.thermalcorrenthalpy: 0.497684 hartree
zpe.thermalcorrgfe: 0.405527 hartree
zpe.sumelectzpe: -1235.252331 hartree
zpe.sumelectthermal: -1235.224308 hartree
zpe.sumelectthermalent: -1235.223363 hartree
zpe.sumelectthermalfe: -1235.315521 hartree
dipole: -3.0052 -0.9833 -0.1165
dipole: 3.1641
quadrupole: -147.1606 -177.1864 -170.6074
quadrupole: -10.6670 3.4603 -4.9361
quadrupole: 17.8242 -12.2016 -5.6226 -10.6670 3.4603 -4.9361
hfenergy: -1235.7210476 hartree
pointgroup: C01[X(C26H28F1N1O1)]
dipole: -1.1914333 -0.2661768 -0.2434962 debye
polarizability: 489.6600153|-40.4343577|295.9844458|7.0388464|43.4057455|215.671602 unknown
InChI: InChI=1S/C26H28FNO/c1-3-28(4-2)18-19-29-25-16-12-23(13-17-25)26(20-21-8-6-5-7-9-21)22-10-14-24(27)15-11-22/h5-17,20H,3-4,18-19H2,1-2H3
charge 0 multiplicity 1
57 atoms
F  3.868751 3.876814 2.856893
O  -3.782581 -0.839795 -1.12767
N  -7.178911 0.168958 0.054809
C  -6.149334 -0.495001 -0.782052
C  -7.424454 1.58059 -0.350383
C  -8.424727 -0.627982 0.208613
C  -4.755878 -0.243724 -0.191373
C  -7.942712 2.459121 0.804044
C  -8.252414 -1.827742 1.15924
C  0.400678 -0.622696 -0.362208
C  -2.422616 -0.733833 -0.811767
C  1.87189 -0.589096 -0.113574
C  -0.517624 -0.034461 0.549904
C  -0.142163 -1.25437 -1.522462
C  -1.911419 -0.087458 0.342093
C  -1.52655 -1.314768 -1.745548
C  2.409343 0.582679 0.651802
C  2.66073 -1.639339 -0.542696
C  4.129692 -1.777721 -0.591785
C  2.087975 1.914364 0.269766
C  3.217052 0.386213 1.806046
C  2.576708 3.02335 0.994202
C  3.709371 1.478987 2.549465
C  5.033808 -0.67762 -0.689519
C  4.681345 -3.093463 -0.619339
C  3.380135 2.776769 2.120547
C  6.424122 -0.890279 -0.780258
C  6.073025 -3.30611 -0.701717
C  6.955055 -2.203074 -0.778793
H  -6.166969 -0.146235 -1.840535
H  -6.330443 -1.583647 -0.803429
H  -6.464495 1.999366 -0.707597
H  -8.131142 1.637021 -1.216925
H  -9.200363 0.040495 0.624026
H  -8.808805 -0.981153 -0.781869
H  -4.672117 -0.718326 0.805469
H  -4.558717 0.842821 -0.087454
H  -8.916766 2.105487 1.187848
H  -7.224387 2.448353 1.642229
H  -8.077631 3.502932 0.464077
H  -7.488254 -2.537789 0.792911
H  -7.940318 -1.478395 2.15881
H  -9.203704 -2.383431 1.257574
H  -0.136352 0.458637 1.450509
H  0.536671 -1.673641 -2.273276
H  -2.581082 0.365818 1.078691
H  -1.93853 -1.788368 -2.64207
H  2.123278 -2.521822 -0.919618
H  1.454822 2.081916 -0.607826
H  3.458007 -0.633921 2.120394
H  2.343486 4.050765 0.700087
H  4.328496 1.335655 3.439725
H  4.642979 0.343597 -0.714392
H  4.002997 -3.954599 -0.567363
H  7.097689 -0.029447 -0.861582
H  6.468487 -4.328127 -0.711976
H  8.036865 -2.362373 -0.848417
