program: Gaussian 09
title: 000199406
version: EM64L-G09RevD.01
frameworkgroup: C1[X(C6H11NS)]
method: RPBEPBE
basis: SDD
operation: Freq
keyword: #p
keyword: freq=noraman
keyword: PBEPBE/SDD
title: #p freq=noraman PBEPBE/SDD
converged: NO YES NO NO
title: Mulliken charges:
elementType: S N C C C C C C H H H H H H H H H H H
charge: 0.157185 -0.006931 0.291443 -0.793345 -0.715464 -0.715781 -0.146391 -0.700684 0.277484 0.277214 0.235784 0.229694 0.206587 0.229480 0.235961 0.206590 0.239241 0.239275 0.252660
chargesum: 0.00000
title: Mulliken charges with hydrogens summed into heavy atoms:
elementType: S N C C C C C C
charge: 0.157185 -0.006931 0.291443 -0.238647 -0.043399 -0.043751 -0.146391 0.030492
polarizability: 1.06864230e+02 9.95828143e-01 8.77333654e+01 2.24730994e-02 -1.32705461e-02 6.39128251e+01
1716.lowfreq: -46.9009 -10.8053 -0.0027 0.0010 0.0014 17.3390 28.2658 120.0273 154.8192
frequency: -46.7707 120.0037 154.7903 228.8994 254.5323 277.0314 304.3645 327.7569 383.0977 414.8975 484.7854 543.9445 553.0239 576.3942 716.5087 761.3844 833.5407 874.6956 934.5573 943.0148 1006.9197 1026.1223 1038.4891 1079.3667 1131.6523 1165.1491 1203.7948 1239.5242 1253.3182 1375.2975 1387.5059 1393.1587 1453.9167 1456.1112 1459.0078 1461.3450 1466.0381 1471.6295 1485.2197 1652.5346 2982.8724 2985.7191 2992.9763 3034.0342 3076.2689 3080.6287 3085.3421 3091.6283 3098.0836 3109.4869 3121.2920
redmass: 3.3622 1.2960 1.7876 1.0527 1.4469 1.5486 2.7687 2.3107 3.1622 2.9452 4.8617 4.0831 5.0375 5.1845 5.6105 5.2937 2.5677 1.5118 1.4115 2.1433 1.3096 1.9891 1.4559 1.1819 2.5918 2.0365 2.2592 2.5524 1.5394 1.2065 1.2426 1.2026 1.0491 1.0448 1.0632 1.0757 1.0485 1.0546 1.0512 9.6584 1.0348 1.0354 1.0364 1.0564 1.0975 1.1003 1.0999 1.1017 1.0996 1.1090 1.0999
irintensity: 0.0640 2.8351 1.4252 0.0059 2.1901 1.8613 1.6443 3.4421 2.1001 2.4318 1.6793 36.9753 2.9749 5.6852 1.8384 16.7186 27.2009 1.8110 0.6736 3.2510 0.0159 0.0405 3.2573 3.7924 76.6449 22.5022 34.5627 9.1615 25.4129 22.6030 29.5892 12.2946 3.9808 18.3124 7.3430 21.8851 4.2245 7.3896 14.0685 100.5684 24.0832 23.6647 11.5769 22.5075 10.3438 15.2318 44.3777 1.2452 37.4310 17.3194 9.7981
temp: 298.150 k
press: 1.00000 atm
elementType: 16 7 6 6 6 6 6 6 1 1 1 1 1 1 1 1 1 1 1
symmnumber: 1
zpe: 416011.3 jmol-1
zpe.correction: 0.158450 hartree
zpe.thermalcorrener: 0.166973 hartree
zpe.thermalcorrenthalpy: 0.167917 hartree
zpe.thermalcorrgfe: 0.125703 hartree
zpe.sumelectzpe: -687.410431 hartree
zpe.sumelectthermal: -687.401909 hartree
zpe.sumelectthermalent: -687.400965 hartree
zpe.sumelectthermalfe: -687.443178 hartree
dipole: -0.8209 0.1780 0.0005
dipole: 0.8400
quadrupole: -51.7244 -59.6511 -57.1141
quadrupole: -5.0997 0.0053 -0.0039
quadrupole: 4.4388 -3.4879 -0.9509 -5.0997 0.0053 -0.0039
hfenergy: -687.5688815 hartree
pointgroup: C01 [X(C6H11N1S1)]
dipole: -0.3278703 0.0366715 -0.019307 debye
dipolederiv: -0.2385133 0.1364004 0.0230679 -0.029893 -0.6576526 -0.1468637 -0.0201398 -0.1325027 -0.1385007 -0.7136699 -0.2558333 -0.0996469 -0.1851328 -0.8764701 -0.1551107 -0.0823874 -0.162577 -0.3918405 0.3514244 0.094533 0.027991 0.0900253 0.2885754 0.0023907 0.0265884 0.0028455 0.3128551 0.1430084 -0.1575208 -0.0359845 -0.087266 -0.155422 -0.0726025 -0.0169079 -0.0790452 0.0731658 -0.017153 -0.0522777 0.0201617 -0.0134042 0.0404881 0.0560124 0.0202079 0.0242316 -0.0444009 -0.0078231 -0.0378434 -0.0346689 -0.0007067 0.0551951 -0.0007224 -0.0150756 0.0244808 -0.0672183 0.6081709 0.0839178 0.0815691 0.0278293 1.2748072 0.3502058 0.0675785 0.3564136 0.034251 -0.2113779 0.0658544 -0.0094398 0.1142725 -0.0872209 -0.0349399 0.0029903 -0.0392392 0.0766617 -0.016541 0.0676172 -0.0447482 0.0452457 0.0112349 0.0782281 -0.052543 0.1159504 -0.0049865 -0.038388 0.0532961 0.0780526 0.0241823 0.0868994 -0.0261956 0.0724692 -0.0590062 -0.0577605 0.0914405 -0.0258247 0.0088977 -0.0855359 -0.1108604 -0.029324 -0.0094183 -0.0783572 0.0738843 0.0436132 0.0009553 -0.1033914 -0.013771 0.0842185 -0.0135945 -0.0616097 0.0108717 -0.1183828 -0.1242771 0.0630218 0.0265754 0.1232962 0.0214686 -0.0030642 0.0236586 0.0263829 0.086796 0.0142931 -0.0604695 0.1084417 -0.0568648 0.0392231 0.087232 0.0638281 0.0634401 -0.0446153 0.0965554 -0.0212193 -0.0193491 -0.0736048 -0.109222 -0.0858311 -0.0304801 -0.0269894 0.0676925 -0.1200881 0.0814101 -0.0235651 0.1269231 0.0397939 0.0014383 0.0072934 -0.0369284 0.0639947 0.0460268 0.0111607 -0.0539463 0.0063823 0.1015249 -0.0488956 -0.103752 -0.0108059 -0.0621191 0.016829 -0.0267779 0.0597872 -0.0612357 0.0404867 0.0929268 0.0993202 0.0583442 0.0279669 0.0764698 -0.0204001 -0.0098045 0.0492583 -0.087068 -0.05129 0.0083793 -0.0575097 0.1125565 unknown
polarizability: 106.0334818|2.2207942|86.5888838|4.3415668|6.0995436|65.8880546 unknown
InChI: InChI=1S/C6H11NS/c1-5-7-6(2,3)4-8-5/h4H2,1-3H3
charge 0 multiplicity 1
19 atoms
S  1.183748 1.563831 0.547233
N  0.233616 -0.884458 -0.175255
C  -1.023087 -0.07994 -0.076557
C  -0.68949 1.418169 0.338685
C  -1.921411 -0.744778 0.995063
C  -1.70845 -0.112727 -1.464595
C  1.329342 -0.250342 0.08745
C  2.710777 -0.844656 0.05621
H  -1.002917 2.130855 -0.440164
H  -1.161873 1.684198 1.297285
H  -2.121588 -1.795591 0.723522
H  -1.426323 -0.730591 1.982478
H  -2.886109 -0.210561 1.075388
H  -1.064608 0.357928 -2.228969
H  -1.898892 -1.156651 -1.768073
H  -2.672802 0.427254 -1.433153
H  3.195203 -0.757801 1.045855
H  3.348858 -0.310577 -0.671189
H  2.649707 -1.907162 -0.225913
