program: Gaussian 09
title: 000199408
version: EM64L-G09RevD.01
frameworkgroup: C1[X(C7H13NS)]
method: RPBEPBE
basis: SDD
operation: Freq
keyword: #p
keyword: freq=noraman
keyword: PBEPBE/SDD
title: #p freq=noraman PBEPBE/SDD
converged: YES YES NO NO
title: Mulliken charges:
elementType: S N C C C C C C C H H H H H H H H H H H H H
charge: 0.140879 -0.006715 -0.082455 -0.071997 -0.757645 -0.713097 -0.705529 -0.120541 -0.714386 0.232906 0.212270 0.268594 0.273219 0.207078 0.219672 0.225828 0.197496 0.206665 0.256473 0.251500 0.241005 0.238783
chargesum: 0.00000
title: Mulliken charges with hydrogens summed into heavy atoms:
elementType: S N C C C C C C C
charge: 0.140879 -0.006715 0.150451 0.140273 -0.215832 -0.060519 -0.044896 -0.120541 0.016902
polarizability: 1.24913275e+02 -8.69033159e-02 1.00925366e+02 -2.13570146e+00 8.57063314e-02 6.69730729e+01
1716.lowfreq: -23.9521 -7.3088 -0.0010 0.0028 0.0029 9.5058 60.8655 84.3717 121.9286
frequency: 60.6215 84.3084 121.9182 148.8097 197.6737 203.8017 229.2391 284.0413 304.6948 361.7192 395.5749 430.2047 493.5448 509.9195 547.2561 640.1151 707.2162 803.2629 872.7581 912.0907 922.9696 942.0745 958.1746 998.6625 1034.7728 1046.7616 1098.5298 1130.9148 1147.7700 1159.5275 1185.1530 1230.3405 1270.6435 1291.3014 1310.7311 1335.3803 1377.8559 1387.4258 1395.6420 1446.6846 1455.5070 1458.6176 1464.1069 1471.3669 1480.5035 1492.7108 1652.6624 2946.6821 2970.8602 2974.7016 2979.0958 2992.2006 3028.9225 3061.2545 3068.0452 3073.9804 3075.5862 3101.2615 3118.8155 3120.6530
redmass: 3.6102 2.5642 1.1470 2.8010 1.2376 1.7592 1.1278 2.8677 3.2354 2.3992 3.5362 2.9213 3.9766 4.4830 5.4204 3.5792 4.9685 2.8823 2.4264 1.4440 1.2771 1.8713 1.6486 2.3473 1.4969 2.0550 1.4597 2.3698 2.9072 1.6575 1.7970 1.2946 1.3403 1.1775 1.4572 1.4378 1.2067 1.2449 1.2113 1.0860 1.0450 1.0579 1.0486 1.0498 1.0473 1.0536 9.1588 1.0817 1.0365 1.0523 1.0694 1.0364 1.0599 1.0987 1.0984 1.0989 1.0973 1.0987 1.1000 1.1057
irintensity: 0.1181 0.2033 1.8560 0.7822 1.1377 3.1343 0.3183 2.4619 6.0777 1.4793 1.3080 1.9224 1.8157 5.6534 35.0382 6.4373 6.4392 14.4602 12.4214 14.2052 3.0628 15.3667 3.1337 10.2719 2.1373 6.3837 17.8265 5.8235 80.3380 4.9694 9.4222 2.9248 9.4718 6.7950 0.6483 0.3804 25.3195 30.3981 20.2279 6.2920 18.9013 19.7335 8.2363 0.9372 10.4264 19.4186 104.4886 12.2602 26.0027 15.8536 58.1716 12.4360 26.7302 10.2939 71.2469 51.4814 13.8633 20.5418 9.2732 12.7357
temp: 298.150 k
press: 1.00000 atm
elementType: 16 7 6 6 6 6 6 6 6 1 1 1 1 1 1 1 1 1 1 1 1 1
symmnumber: 1
zpe: 490275.2 jmol-1
zpe.correction: 0.186736 hartree
zpe.thermalcorrener: 0.197463 hartree
zpe.thermalcorrenthalpy: 0.198407 hartree
zpe.thermalcorrgfe: 0.150519 hartree
zpe.sumelectzpe: -726.630562 hartree
zpe.sumelectthermal: -726.619835 hartree
zpe.sumelectthermalent: -726.618891 hartree
zpe.sumelectthermalfe: -726.666779 hartree
dipole: -0.7660 -0.2557 -0.1282
dipole: 0.8176
quadrupole: -60.5868 -65.0338 -63.4181
quadrupole: 5.9879 -0.3514 -0.6451
quadrupole: 2.4261 -2.0209 -0.4052 5.9879 -0.3514 -0.6451
hfenergy: -726.8172979 hartree
pointgroup: C01 [X(C7H13N1S1)]
dipole: -0.3100569 0.0717305 0.0468794 debye
dipolederiv: -0.2718118 0.0341998 -0.0014079 -0.1210271 -0.708038 -0.0439838 -0.0137834 -0.0040712 -0.1078859 -0.8629303 -0.2936064 -0.0543246 -0.2468172 -0.810589 -0.0656482 0.0409357 -0.0452918 -0.2581773 0.2820463 0.071053 0.040791 0.07748 0.183818 0.0095373 0.0583906 0.021869 0.2796609 0.1763597 0.0166626 0.0017704 -0.0065619 0.1020555 0.0013245 -0.067693 -0.0277081 0.1386476 0.157254 -0.1936774 -0.0684729 -0.0721475 -0.1032996 -0.0382813 -0.092313 -0.0315447 0.1249197 -0.0567872 0.0507371 -0.0014597 0.0331136 -0.0343342 0.0085122 0.0424483 0.0056556 0.0933688 -0.0362751 -0.0132013 -0.0078061 -0.0025696 -0.0963518 -0.0371697 0.0378196 -0.0128146 0.0953539 0.6597135 0.2166123 0.117452 0.146759 1.3026141 0.0672961 0.0874753 0.0427316 -0.0360257 -0.1879533 0.0779882 -0.0314995 0.1269721 -0.1228097 0.012503 -0.0426389 0.006349 0.066673 -0.0234244 -0.0033606 -0.0475608 0.0657679 0.0378796 -0.0047127 -0.0710674 -0.0047212 -0.1442071 0.0176719 0.0066087 -0.0738017 -0.0095897 0.0190371 -0.0094373 -0.0413454 -0.0009752 -0.1665424 0.0238393 0.0861689 -0.0333754 0.0660486 -0.0081428 0.0564289 -0.0335831 0.0864943 0.0330248 -0.031486 0.0587146 0.0844201 0.0132392 0.0739978 -0.0030165 0.0890766 -0.0578577 -0.0813738 0.0799953 0.0172483 -0.0045526 0.0133936 0.0712759 -0.0032282 -0.0762885 0.0432165 -0.1632351 -0.1601949 -0.0353871 0.083504 -0.0851844 0.0765265 0.0479275 0.0986082 0.0305096 0.0455998 0.1013929 -0.0657493 -0.0414047 -0.0366038 -0.1498441 -0.0732376 -0.0302852 -0.0775657 0.053119 0.080859 -0.0153111 -0.0442203 0.009984 0.0669133 0.0538736 -0.080261 -0.0243969 -0.1665028 -0.1375216 -0.1187793 0.0982084 -0.0851821 0.0483045 0.012287 0.1200524 0.0414574 0.022164 0.0559415 0.1513244 -0.0221349 0.1249133 -0.0059245 0.0102849 -0.0265186 0.0129073 0.0881413 0.0783845 -0.0499417 -0.0093664 0.023129 -0.1025223 -0.0029416 -0.0093995 -0.0103877 0.1244309 0.0510338 0.0061802 -0.0636964 -0.0016653 0.079466 -0.0674435 -0.1047423 -0.0245931 -0.0498485 0.0038931 -0.004484 0.0789378 -0.0334516 0.0799677 0.0691256 0.1151124 0.0307375 0.0086947 unknown
polarizability: 124.6056191|2.1305954|101.0849136|3.2525909|1.339746|67.1211806 unknown
InChI: InChI=1S/C7H13NS/c1-5(2)7-4-9-6(3)8-7/h5,7H,4H2,1-3H3
charge 0 multiplicity 1
22 atoms
S  1.943853 1.554907 0.078193
N  0.616389 -0.810875 -0.144174
C  -0.4521 0.206181 -0.36355
C  -1.775226 -0.22037 0.330964
C  0.049995 1.615291 0.108173
C  -2.888764 0.827105 0.089872
C  -2.225251 -1.61691 -0.154726
C  1.799426 -0.321682 0.039112
C  3.059662 -1.120181 0.216921
H  -0.635482 0.23108 -1.460522
H  -1.566918 -0.278535 1.419914
H  -0.282962 2.421673 -0.561257
H  -0.263896 1.831739 1.143242
H  -3.092025 0.939224 -0.993013
H  -3.828807 0.506576 0.5746
H  -2.628554 1.822791 0.493393
H  -2.474449 -1.593815 -1.233695
H  -3.126033 -1.948714 0.393959
H  -1.421453 -2.356758 -0.00757
H  2.828833 -2.195804 0.165743
H  3.53307 -0.893839 1.189202
H  3.792794 -0.870284 -0.57188
