program: Gaussian 09
title: 000199405
version: EM64L-G09RevD.01
frameworkgroup: C1[X(C6H11NO2)]
method: RPBEPBE
basis: SDD
operation: Freq
keyword: #p
keyword: freq=noraman
keyword: PBEPBE/SDD
title: #p freq=noraman PBEPBE/SDD
converged: YES YES NO NO
title: Mulliken charges:
elementType: O O N C C C C C C H H H H H H H H H H H
charge: -0.314575 -0.287361 -0.620971 -0.018321 -0.448781 -0.439242 -0.436452 -0.429481 0.287350 0.266256 0.199891 0.239318 0.235082 0.226182 0.223725 0.217856 0.215650 0.213640 0.332357 0.337876
chargesum: 0.00000
title: Mulliken charges with hydrogens summed into heavy atoms:
elementType: O O N C C C C C C
charge: -0.314575 -0.287361 0.049262 0.247934 -0.009571 0.022022 0.005130 -0.000191 0.287350
polarizability: 8.99638316e+01 -1.69705660e-01 7.23872661e+01 -3.28271445e+00 4.10405934e+00 6.25856543e+01
1716.lowfreq: -36.8060 -14.2198 -0.0003 0.0003 0.0005 5.5975 20.0540 43.8358 92.8736
frequency: 13.9045 40.7310 92.8679 146.8283 216.4476 321.3528 383.6022 456.1046 478.6661 513.4090 563.1702 597.4915 685.4538 705.0118 759.9010 792.1690 847.4730 886.7328 901.6780 911.5036 937.1254 980.4798 1011.7849 1052.4278 1062.1553 1089.4243 1160.8322 1162.0107 1194.9636 1219.9626 1256.1654 1285.7284 1291.4167 1304.0776 1316.4862 1319.3786 1351.4242 1449.8933 1455.9867 1465.9057 1482.3154 1584.7635 1676.1932 2996.0060 2996.8325 3004.8784 3021.8234 3053.4101 3063.4524 3070.9820 3081.6428 3090.1219 3558.6150 3717.9912
redmass: 2.2469 5.6106 4.0193 2.4755 3.3532 2.5936 3.1746 2.4843 1.1872 1.0518 1.9531 4.8230 2.6857 8.8519 2.4934 2.0306 2.0429 3.1861 2.3238 2.2686 1.5880 4.7608 1.4822 1.9696 1.9359 1.6272 1.4399 1.6718 1.4303 1.4148 1.2650 1.3622 1.6380 1.2541 1.5303 1.5612 1.8776 1.0881 1.0822 1.0859 1.0970 1.2302 6.9087 1.0613 1.0648 1.0626 1.0636 1.0958 1.0926 1.1020 1.1008 1.1035 1.0443 1.1058
irintensity: 0.2368 3.7298 7.1134 4.2893 9.9755 3.1369 6.1343 3.6436 310.3327 13.4734 3.3650 2.2343 1.8197 26.7831 2.7129 5.0606 5.5219 7.5664 8.7228 8.0073 5.9954 181.0772 2.2341 15.7789 1.6562 4.8258 39.0625 1.6244 5.3099 16.2527 1.2123 25.0842 253.1411 3.1808 20.7606 49.5538 102.5140 16.0212 7.1240 9.2397 6.1765 97.5100 360.6604 35.5344 25.0972 40.3107 25.0699 32.7136 3.1296 23.5308 14.0660 86.7773 56.1092 45.9922
temp: 298.150 k
press: 1.00000 atm
elementType: 8 8 7 6 6 6 6 6 6 1 1 1 1 1 1 1 1 1 1 1
symmnumber: 1
zpe: 443103.7 jmol-1
zpe.correction: 0.168769 hartree
zpe.thermalcorrener: 0.178091 hartree
zpe.thermalcorrenthalpy: 0.179035 hartree
zpe.thermalcorrgfe: 0.132227 hartree
zpe.sumelectzpe: -439.738325 hartree
zpe.sumelectthermal: -439.729003 hartree
zpe.sumelectthermalent: -439.728059 hartree
zpe.sumelectthermalfe: -439.774867 hartree
dipole: -0.5570 -2.1460 -1.1882
dipole: 2.5155
quadrupole: -47.5965 -55.4882 -52.9808
quadrupole: -8.3649 -6.5006 0.5871
quadrupole: 4.4254 -3.4664 -0.9590 -8.3649 -6.5006 0.5871
hfenergy: -439.9070944 hartree
pointgroup: C01 [X(C6H11N1O2)]
dipole: 0.3028469 -0.6628577 0.6695761 debye
dipolederiv: -1.7008185 0.0262003 0.2791017 0.2299523 -0.4647117 0.0225088 0.249481 0.0953879 -0.4377716 -0.7786498 0.1352703 -0.0447953 0.193295 -0.7196243 0.3159902 -0.0706159 0.3227974 -0.6608568 -0.8211841 -0.3565989 0.3208482 -0.366664 -0.6778034 0.0512468 0.3893156 0.0739578 -0.9128205 0.7796018 0.1068332 -0.1422734 0.2432593 0.3437733 -0.0176854 -0.4014741 0.0059774 0.3661351 -0.0057272 0.0183771 -0.0382743 0.0731618 -0.0200713 -0.0713172 -0.0022777 -0.0142254 0.0948514 0.0013846 -0.0099732 -0.013005 -0.0686514 -0.0802566 -0.0610164 0.0102451 -0.0999233 0.0523522 0.0901059 0.0172908 -0.0731966 -0.0033633 0.0340692 -0.0158163 -0.0119263 -0.0275314 0.0693015 0.0933135 0.036184 -0.0391924 0.0066629 0.0096964 0.0124023 -0.0874277 -0.0096852 0.1172675 2.1195851 -0.0030481 -0.4500215 -0.2854963 0.9651086 -0.5880464 -0.3236103 -0.6642128 1.0679656 -0.0532648 -0.0151305 -0.0867285 -0.0472691 0.0486634 0.0401459 -0.0070505 0.0059928 -0.0791026 -0.0384156 0.0040117 0.0980581 -0.0185777 0.0838768 0.0712341 0.0764591 0.0212179 -0.1169925 0.0670713 -0.0809347 -0.0261571 -0.0655591 -0.1385062 -0.0498699 -0.0360559 -0.0102187 0.0764264 -0.0325802 0.0546601 0.0725038 0.0606529 0.0522151 -0.0327691 0.0944126 -0.0690685 -0.0226664 0.0237286 -0.002906 -0.0040811 -0.0250398 -0.0460191 0.1042458 -0.0197103 0.1360673 -0.0258035 -0.1807579 0.1125702 -0.0197205 0.0954497 0.0207026 0.004757 0.0009844 -0.0117106 0.0781598 0.0608458 -0.0646402 0.0934348 -0.0376299 0.0104427 0.0543929 0.0572871 0.0690583 -0.1069983 0.0418435 -0.0175734 -0.0393536 -0.0349157 0.0070444 -0.0968536 -0.0873872 -0.1129208 -0.1235397 -0.0972338 -0.067919 0.0780185 -0.047388 0.0124928 0.046938 0.131251 0.0851463 -0.0171585 0.2104525 0.0486757 0.0265892 0.0698493 0.280768 0.0985902 0.0061868 0.1007133 0.2927432 0.2206993 0.0586507 0.0082449 0.0282709 0.2781392 0.1109221 0.0319133 0.1031803 0.2885076 unknown
polarizability: 89.4456691|-0.1705326|69.3047668|-4.6046718|-6.280805|66.1863161 unknown
InChI: InChI=1S/C6H11NO2/c7-6(8)9-5-3-1-2-4-5/h5H,1-4,7H2
charge 0 multiplicity 1
20 atoms
O  -0.645899 -0.647539 0.218421
O  -2.314324 0.802191 -0.617145
N  -2.740242 -0.745828 1.095612
C  0.348102 -0.031773 -0.725379
C  1.521202 -1.024403 -0.799431
C  0.939652 1.273705 -0.121191
C  2.398386 -0.654168 0.42255
C  2.352567 0.899935 0.43548
C  -1.942973 -0.110137 0.164634
H  -0.174024 0.136772 -1.682148
H  2.080693 -0.840017 -1.737588
H  1.172762 -2.070794 -0.807314
H  0.268383 1.65126 0.668947
H  0.997178 2.062263 -0.892091
H  3.425958 -1.052375 0.352982
H  1.937052 -1.058984 1.342603
H  2.528754 1.315571 1.443047
H  3.141797 1.302231 -0.227618
H  -2.359326 -1.48197 1.684577
H  -3.716196 -0.473544 1.166353
