program: Gaussian 09
title: 000199411
version: EM64L-G09RevD.01
frameworkgroup: C1[X(C14H9N3O)]
method: RPBEPBE
basis: SDD
operation: Freq
keyword: #p
keyword: freq=noraman
keyword: PBEPBE/SDD
title: #p freq=noraman PBEPBE/SDD
converged: NO YES NO YES
title: Mulliken charges:
elementType: O N N N C C C C C C C C C C C C C C H H H H H H H H H
charge: -0.249501 -0.324897 -0.422585 -0.019656 0.293411 0.070805 0.264043 0.109411 0.122412 0.111791 -0.346300 -0.367745 -0.318698 -0.222706 -0.362810 -0.210581 -0.250906 -0.208950 0.336085 0.301738 0.240392 0.268083 0.232568 0.259107 0.230992 0.232922 0.231577
chargesum: 0.00000
title: Mulliken charges with hydrogens summed into heavy atoms:
elementType: O N N N C C C C C C C C C C C C C C
charge: -0.249501 -0.324897 -0.086500 -0.019656 0.293411 0.070805 0.264043 0.109411 0.122412 0.111791 -0.044562 -0.127354 -0.050614 0.009862 -0.103703 0.020411 -0.017984 0.022627
polarizability: 3.24132699e+02 2.76115240e+00 1.76348591e+02 4.33568897e-03 -1.82184146e-02 6.45886544e+01
1716.lowfreq: -3.0203 -0.0006 0.0005 0.0009 3.4200 4.1530 57.7602 99.6488 137.1169
frequency: 57.7568 99.6471 137.1164 159.9995 175.0763 250.1835 282.4821 313.5715 343.4393 344.0092 386.0727 433.7763 447.9134 486.7809 538.1813 544.3246 555.2415 559.2157 573.3813 614.8752 639.3842 677.2512 677.6857 702.2536 717.9277 753.8910 759.3253 778.2772 793.9591 824.2303 864.8582 866.5783 886.2829 892.1223 946.1079 977.6664 985.3699 999.3146 1002.6721 1017.6905 1038.5058 1090.8404 1102.1766 1132.3310 1163.9889 1170.1476 1201.4793 1227.8953 1236.6615 1251.3122 1299.4808 1303.8341 1335.9407 1350.5038 1384.3557 1420.9359 1451.3723 1458.6329 1471.6807 1473.6939 1552.2317 1586.1234 1612.9235 1615.0483 1631.8437 1648.0883 3133.8238 3140.0324 3147.5008 3154.7520 3162.5938 3169.9481 3172.5680 3202.4042 3620.0928
redmass: 6.2740 4.1683 6.4377 5.4811 5.8295 5.5012 6.8293 5.3206 7.4227 5.8461 6.5673 3.3421 3.4738 6.5457 2.8629 8.7693 8.9105 1.2248 3.9014 6.9983 6.2544 5.5291 6.3463 5.9047 6.5490 4.5769 1.2940 1.6243 2.8818 6.5664 1.3935 6.9034 5.0940 1.5293 1.3668 1.3706 1.3032 1.3297 3.6823 2.2468 2.3483 2.6845 2.3449 2.1717 1.1411 1.0844 2.1747 1.8661 2.5847 2.1997 1.7262 3.9549 4.2117 2.3004 8.5931 3.6014 2.6316 3.0615 3.4759 3.1757 6.5382 9.1740 7.4509 7.8932 7.4391 9.3416 1.0860 1.0863 1.0897 1.0921 1.0953 1.0983 1.1001 1.0961 1.0810
irintensity: 3.3844 0.2313 1.4881 1.0343 0.0115 0.1831 5.9049 0.2805 3.3218 2.6973 0.2606 1.9604 9.1202 0.1566 3.6524 0.4125 0.2743 128.5708 2.4337 6.1362 2.8895 8.8810 1.8468 1.8732 23.7647 1.7998 103.8693 94.4895 3.3487 2.2563 0.2172 13.2794 1.1501 0.9347 6.4673 2.9540 0.7698 0.0000 4.5490 29.3307 3.4556 4.7730 15.5520 36.5863 2.1430 0.5169 11.4872 12.5126 27.0026 2.5552 4.6009 47.8624 42.1401 15.7483 24.0088 3.7357 22.1433 86.1426 145.9309 23.6442 3.7165 364.0933 324.5076 51.4954 60.3190 470.7252 5.9725 1.8851 5.7089 14.5011 13.0816 23.6738 25.7813 2.8175 96.4352
temp: 298.150 k
press: 1.00000 atm
elementType: 8 7 7 7 6 6 6 6 6 6 6 6 6 6 6 6 6 6 1 1 1 1 1 1 1 1 1
symmnumber: 1
zpe: 527443.3 jmol-1
zpe.correction: 0.200893 hartree
zpe.thermalcorrener: 0.213219 hartree
zpe.thermalcorrenthalpy: 0.214163 hartree
zpe.thermalcorrgfe: 0.162412 hartree
zpe.sumelectzpe: -777.211628 hartree
zpe.sumelectthermal: -777.199301 hartree
zpe.sumelectthermalent: -777.198357 hartree
zpe.sumelectthermalfe: -777.250109 hartree
dipole: 1.9371 -2.8168 0.0008
dipole: 3.4186
quadrupole: -79.0306 -99.3161 -108.5213
quadrupole: -5.4190 0.0016 -0.0029
quadrupole: 16.5921 -3.6935 -12.8986 -5.4190 0.0016 -0.0029
hfenergy: -777.4125201 hartree
pointgroup: C01 [X(C14H9N3O1)]
dipole: -0.7673479 -1.1046184 -0.0003199 debye
polarizability: 324.1032894|-3.4596762|176.3780009|0.0044218|0.0181977|64.5886544 unknown
InChI: InChI=1S/C14H9N3O/c18-13-9-5-1-2-6-10(9)15-14-16-11-7-3-4-8-12(11)17(13)14/h1-8,16H
charge 0 multiplicity 1
27 atoms
O  0.296835 2.388563 -0.00003
N  -0.446647 0.164642 -0.00037
N  -1.375716 -1.886105 -0.000706
N  1.047705 -1.775055 -0.00065
C  -1.856169 0.348175 -0.000405
C  -0.150518 -1.222713 -0.00059
C  -2.435968 -0.957851 -0.00064
C  0.587268 1.156271 -0.000168
C  1.936891 0.563296 -0.000261
C  2.121852 -0.867931 -0.000499
C  -2.649302 1.508545 -0.000239
C  -3.829665 -1.137355 -0.000706
C  3.067615 1.425309 -0.000121
C  -4.0538 1.325744 -0.000324
C  3.448502 -1.386355 -0.0006
C  -4.631769 0.029955 -0.000553
C  4.365322 0.894076 -0.000217
C  4.551153 -0.519257 -0.000461
H  -1.442068 -2.901243 -0.001057
H  -2.186198 2.496698 -0.000048
H  -4.28157 -2.133976 -0.000863
H  2.88842 2.505723 0.000063
H  -4.705638 2.205289 -0.000208
H  3.571013 -2.473618 -0.000788
H  -5.722068 -0.072846 -0.000607
H  5.233986 1.56057 -0.000108
H  5.565834 -0.932851 -0.000544
