program: Gaussian 09
title: 000199404
version: EM64L-G09RevD.01
frameworkgroup: C1[X(C10H8BrNOS2)]
method: RPBEPBE
basis: SDD
operation: Freq
keyword: #p
keyword: freq=noraman
keyword: PBEPBE/SDD
title: #p freq=noraman PBEPBE/SDD
converged: YES YES NO NO
title: Mulliken charges:
elementType: Br S S O N C C C C C C C C C C H H H H H H H H
charge: 0.021038 0.340549 0.144719 -0.193530 -0.180717 -0.446265 -0.691878 0.212983 0.466878 -0.632697 -0.305474 -0.283359 -0.159707 -0.168608 -0.223357 0.265880 0.261745 0.282893 0.282021 0.250493 0.249188 0.253659 0.253547
chargesum: 0.00000
title: Mulliken charges with hydrogens summed into heavy atoms:
elementType: Br S S O N C C C C C C C C C C
charge: 0.021038 0.340549 0.144719 -0.193530 -0.180717 0.081360 -0.126964 0.212983 0.466878 -0.632697 -0.054981 -0.034171 0.093952 0.084939 -0.223357
polarizability: 2.47317016e+02 -1.39167787e+01 1.47854360e+02 8.07681105e+00 -2.53733477e+00 1.11883030e+02
1716.lowfreq: -7.3524 -5.6422 -2.5242 -0.0020 -0.0013 0.0011 26.5769 38.3461 40.9787
frequency: 26.5511 38.3392 40.9736 67.0999 99.6924 140.5550 161.3412 203.7291 235.8357 268.7733 323.5891 337.2211 350.1961 404.8924 408.1601 427.1311 459.9406 494.4718 539.3843 555.1428 616.4299 620.3496 642.6639 681.5906 703.9530 776.6408 811.5762 822.3540 855.3067 907.2177 952.5578 966.1492 968.7722 992.1460 1008.1268 1038.6985 1057.9593 1106.0808 1131.5260 1150.1229 1176.1874 1189.0317 1242.4814 1266.0300 1284.8602 1287.7955 1327.8799 1367.4684 1388.0538 1436.6416 1449.8623 1467.4186 1590.0898 1592.6316 1617.5073 2999.1756 3039.8323 3079.9420 3117.2298 3154.5064 3158.2199 3176.0541 3179.9786
redmass: 4.7563 11.4706 7.5662 5.1967 9.2413 9.7663 11.3080 2.8430 4.6298 15.4118 8.2523 8.7304 6.2052 6.1611 2.8670 9.8962 3.5443 3.5596 4.7561 6.3337 6.0986 6.7630 6.4307 4.5921 4.0801 3.4739 1.7123 1.2499 2.4243 4.1544 1.3873 1.3882 1.6835 5.6370 4.0697 2.8993 2.3882 1.3315 1.1754 2.4347 1.3748 2.4308 2.8448 2.8459 1.3404 1.2426 1.5337 6.5031 3.5220 1.0781 1.0903 2.4084 8.0574 6.4993 11.0302 1.0638 1.0585 1.0971 1.1082 1.0895 1.0893 1.0969 1.0979
irintensity: 0.1003 0.8584 1.9736 4.0899 1.1197 1.3422 0.6219 2.8206 0.3926 5.4545 7.1671 10.2658 4.1862 7.1796 0.0294 1.2807 2.4000 8.7962 25.9697 10.2583 2.0696 0.3115 2.6717 7.6022 3.8423 67.2903 33.1154 0.2725 14.6258 18.1194 6.2876 0.0944 1.3368 24.7092 85.9068 77.9822 23.7508 9.0079 0.9491 156.7642 68.8112 87.1563 141.2048 157.4535 13.0151 0.3118 12.8132 0.7056 9.4686 19.4669 13.5889 104.4464 1.0249 18.5270 203.0422 5.1555 16.5795 7.0608 6.2258 2.7528 3.3563 5.0287 0.3740
temp: 298.150 k
press: 1.00000 atm
elementType: 35 16 16 8 7 6 6 6 6 6 6 6 6 6 6 1 1 1 1 1 1 1 1
symmnumber: 1
zpe: 412604.7 jmol-1
zpe.correction: 0.157153 hartree
zpe.thermalcorrener: 0.171298 hartree
zpe.thermalcorrenthalpy: 0.172242 hartree
zpe.thermalcorrgfe: 0.112791 hartree
zpe.sumelectzpe: -1324.352103 hartree
zpe.sumelectthermal: -1324.337958 hartree
zpe.sumelectthermalent: -1324.337013 hartree
zpe.sumelectthermalfe: -1324.396465 hartree
dipole: 3.5279 -2.0423 0.6650
dipole: 4.1303
quadrupole: -97.4624 -126.2225 -101.5950
quadrupole: -12.9546 2.5448 1.0843
quadrupole: 10.9642 -17.7959 6.8317 -12.9546 2.5448 1.0843
hfenergy: -1324.5092558 hartree
pointgroup: C01 [X(C10H8Br1N1O1S2)]
dipole: 1.4308484 0.712336 -0.292888 debye
dipolederiv: -0.7959069 0.0287517 -0.0127279 0.0117327 -0.0298609 -0.0050912 -0.016473 -0.0041402 -0.0612887 -0.5833316 -0.1334509 0.1428003 -0.0064007 0.0165901 -0.0503495 0.1013643 0.0029987 -0.0310801 -0.5472826 -0.2798683 0.1116312 -0.1897202 -0.6834896 0.1209054 0.1285427 0.1180429 -0.1383339 -0.6124581 0.3438257 -0.0075891 0.0010893 -1.1380958 -0.0205155 -0.0030061 0.0015239 -0.2700982 -0.6469609 -0.123767 0.055454 0.171962 -1.6792188 0.0097461 0.0030902 -0.0297244 -0.1079298 -0.2711575 -0.0411375 -0.0118749 -0.0667706 -0.069082 -0.0135804 -0.026365 0.0307016 0.0549535 -0.020895 0.0382013 0.0170324 0.065984 0.1868721 -0.0633452 0.0165947 -0.0356709 0.1234765 0.8239078 0.2085489 0.0663837 0.2036835 1.8487234 0.0539578 0.0904583 0.0091191 0.1493107 0.631202 -0.1063656 0.0253681 -0.0433469 0.0454555 -0.0112896 0.0013684 0.0369022 0.1241304 1.3166106 0.0167243 -0.3557419 -0.0671764 1.3326841 -0.1947274 -0.3504555 -0.1886976 -0.0707302 -0.0555381 0.0105386 -0.0757243 0.0363667 -0.0985276 0.0294572 0.1038302 0.0126682 0.0074883 -0.064263 0.0316278 0.0774523 0.0135563 -0.0695506 0.0161151 -0.0893703 0.0167879 0.0277186 -0.4342656 0.0429702 0.1419508 0.015839 -0.0749219 0.0118932 0.0440248 0.0169016 0.0109518 -0.4080949 -0.0137196 -0.1689259 0.0103911 -0.0759774 0.0148307 -0.0542044 0.0125856 0.0058778 1.4336728 -0.0353044 0.0235273 -0.0327506 -0.1206434 0.0296826 0.0171341 0.0320482 0.0670655 0.0765468 0.022593 0.0133288 -0.0655504 -0.0794204 0.0170369 0.0268826 0.0006596 0.1099097 0.0409778 -0.0038032 -0.0055617 0.0498537 0.1197816 0.0547632 -0.004371 0.0072172 -0.051344 0.0926104 0.0123758 -0.0625223 -0.0582406 -0.0294716 0.0633469 -0.0047116 0.0285751 -0.0777588 -0.1059075 -0.0215222 0.0176349 -0.0439988 0.049206 0.023025 0.0114835 0.0085988 0.1040883 0.0207113 0.0077464 0.0807222 0.0096823 0.1251764 -0.0230202 0.0814155 -0.0230023 0.0115721 0.0271779 -0.0168381 -0.0739431 -0.0148333 0.1207412 -0.0168905 -0.0793487 -0.0084905 0.0086146 0.042877 -0.002596 -0.0618566 -0.0107681 0.1520027 -0.0229737 -0.0622095 -0.0207683 -0.0015066 0.0397671 0.0144689 0.0631817 0.0094159 0.151027 -0.0229772 0.0643258 -0.0248364 0.0049126 unknown
polarizability: 248.4395224|7.621843|146.4310003|-9.8102269|-2.9159793|112.1838823 unknown
InChI: InChI=1S/C10H8BrNOS2/c11-7-1-3-8(4-2-7)12-9(13)5-6-15-10(12)14/h1-4H,5-6H2
charge 0 multiplicity 1
23 atoms
Br -5.231452 0.044645 -0.095916
S  3.410919 -1.409881 -0.302867
S  0.831936 -2.746302 0.420043
O  0.889956 2.296722 0.116472
N  0.990233 -0.034439 0.02172
C  3.127676 1.33438 0.179084
C  3.826619 0.37644 -0.788991
C  1.607555 1.266265 0.097254
C  -0.478441 -0.029213 0.005066
C  1.631044 -1.297751 0.06407
C  -1.149552 -0.196925 -1.222453
C  -1.195222 0.167221 1.20212
C  -2.56068 -0.177507 -1.258137
C  -2.605682 0.190543 1.177516
C  -3.270163 0.01576 -0.054704
H  3.400315 2.382331 -0.032058
H  3.443583 1.111379 1.217295
H  3.523355 0.538278 -1.835927
H  4.922912 0.446453 -0.710308
H  -0.579674 -0.348728 -2.144374
H  -0.661875 0.297585 2.148431
H  -3.092509 -0.309044 -2.204265
H  -3.172953 0.340285 2.100033
