program: Gaussian 09
title: 000199401
version: EM64L-G09RevD.01
frameworkgroup: C1[X(C12H10N3OP)]
method: RPBEPBE
basis: SDD
operation: Freq
keyword: #p
keyword: freq=noraman
keyword: PBEPBE/SDD
title: #p freq=noraman PBEPBE/SDD
converged: YES YES NO NO
title: Mulliken charges:
elementType: P O N N N C C C C C C C C C C C C H H H H H H H H H H
charge: 1.012884 -0.593356 -0.334627 0.038049 -0.032856 -0.120993 -0.126198 -0.294547 -0.237457 -0.227751 -0.292496 -0.207209 -0.217620 -0.238169 -0.205205 -0.217943 -0.220189 0.274360 0.249669 0.277351 0.290371 0.238420 0.236838 0.237227 0.238561 0.236290 0.236594
chargesum: 0.00000
title: Mulliken charges with hydrogens summed into heavy atoms:
elementType: P O N N N C C C C C C C C C C C C
charge: 1.012884 -0.593356 -0.334627 0.038049 -0.032856 -0.120993 -0.126198 -0.020186 0.012213 0.049599 -0.002125 0.031211 0.019218 -0.000942 0.033356 0.018348 0.016405
polarizability: 2.11175578e+02 -1.62735411e+01 1.57853427e+02 -6.91366599e+00 -5.06473306e+00 1.57097518e+02
1716.lowfreq: -7.2217 -0.0024 -0.0005 0.0016 2.2432 5.2666 20.7107 33.8031 37.1609
frequency: 20.6445 33.7904 37.0731 51.2894 79.8237 117.1842 159.1890 164.2952 218.9528 237.8596 243.0702 278.3619 319.6700 382.3591 395.8786 398.3848 448.1527 465.2058 509.2335 513.6235 532.8541 585.6512 609.9493 612.6209 674.7339 697.8138 702.0284 704.1053 760.4180 765.2660 856.8822 861.6921 934.2855 937.3033 984.0765 984.8853 986.0606 987.6047 996.8748 1005.0923 1008.9648 1020.3322 1023.3918 1078.2080 1083.3339 1085.5221 1097.3711 1175.1299 1176.6407 1188.2677 1193.1832 1238.4177 1310.9053 1316.1089 1379.8667 1381.8312 1426.6853 1429.2910 1464.7440 1467.7272 1586.9355 1589.2781 1594.0901 1596.6582 2042.1280 3130.9214 3132.3944 3137.1513 3140.8066 3145.3961 3150.2402 3156.5918 3160.8703 3169.7334 3171.5514
redmass: 3.7995 9.4430 4.2724 5.4640 8.5974 7.8317 5.4861 8.4172 5.4227 7.4089 7.3709 6.5008 8.8731 8.0327 2.8251 2.8159 4.8346 6.3748 10.1779 6.2937 6.7673 13.0412 6.4730 6.5307 6.7195 2.6005 1.9389 3.6843 1.6560 1.6430 1.2504 1.2431 1.3614 1.3709 2.6513 2.0615 3.7172 1.6474 8.7497 1.3332 1.3271 2.9594 2.9022 1.6509 2.0830 2.0519 2.8391 1.0564 1.0549 1.1285 1.1246 13.4567 1.3217 1.3156 8.5302 8.9954 2.1153 2.1337 2.0330 2.0359 6.0666 6.1240 5.8103 5.8198 13.9983 1.0853 1.0854 1.0881 1.0886 1.0926 1.0927 1.0967 1.0966 1.1017 1.1016
irintensity: 0.0983 0.3057 0.1698 0.3516 0.4097 1.5382 2.0426 3.2651 0.9241 7.2621 12.5368 3.3310 0.8021 12.6079 0.4275 0.0327 16.5608 27.0122 47.9803 63.8223 207.9412 14.3544 0.1560 1.8377 14.7094 6.8070 80.5363 76.8726 15.1179 37.6569 0.1678 0.0994 0.2006 0.9869 5.5714 10.0040 2.8491 1.1340 38.5832 0.1766 0.0189 2.9806 4.6612 6.8794 23.0966 29.0739 41.2845 0.1257 0.0441 5.2599 5.5255 136.7450 1.9339 6.2913 0.4098 1.0062 3.3258 35.7067 8.9054 10.5134 0.0706 0.2293 0.1946 0.2915 561.2427 0.1882 0.2253 3.4623 3.6466 4.2711 8.4122 17.1023 15.0556 30.0940 22.0027
temp: 298.150 k
press: 1.00000 atm
elementType: 15 8 7 7 7 6 6 6 6 6 6 6 6 6 6 6 6 1 1 1 1 1 1 1 1 1 1
symmnumber: 1
zpe: 512629.2 jmol-1
zpe.correction: 0.195250 hartree
zpe.thermalcorrener: 0.210678 hartree
zpe.thermalcorrenthalpy: 0.211622 hartree
zpe.thermalcorrgfe: 0.149872 hartree
zpe.sumelectzpe: -1042.727130 hartree
zpe.sumelectthermal: -1042.711703 hartree
zpe.sumelectthermalent: -1042.710759 hartree
zpe.sumelectthermalfe: -1042.772508 hartree
dipole: 0.9998 -5.0417 -2.7693
dipole: 5.8385
quadrupole: -88.3504 -114.5418 -103.6355
quadrupole: 5.3474 -2.4061 -2.9524
quadrupole: 13.8255 -12.3659 -1.4596 5.3474 -2.4061 -2.9524
hfenergy: -1042.9223806 hartree
pointgroup: C01 [X(C12H10N3O1P1)]
dipole: -0.3213849 -1.8231531 1.3598612 debye
polarizability: 209.3507505|18.6890704|162.0077595|-6.8592665|4.9480155|154.7680127 unknown
InChI: InChI=1S/C12H10N3OP/c13-14-15-17(16,11-7-3-1-4-8-11)12-9-5-2-6-10-12/h1-10H
charge 0 multiplicity 1
27 atoms
P  -0.014673 0.581286 -0.901668
O  0.193554 0.79823 -2.478391
N  -0.125007 2.105574 0.158484
N  0.714195 3.043337 0.051821
N  1.432487 3.987446 0.029986
C  -1.641451 -0.158179 -0.410147
C  1.407329 -0.36072 -0.14598
C  -2.242588 -1.044158 -1.335417
C  1.439377 -0.689859 1.229286
C  -2.26496 0.139961 0.823411
C  2.460353 -0.738617 -1.011261
C  -3.473253 -1.655423 -1.009208
C  2.541831 -1.408401 1.741867
C  -3.495558 -0.476802 1.140721
C  3.559624 -1.456812 -0.489398
C  -4.096409 -1.376965 0.229652
C  3.600451 -1.791431 0.883939
H  -1.761537 -1.235322 -2.301143
H  0.621768 -0.392181 1.895184
H  -1.811481 0.865729 1.50577
H  2.405384 -0.466741 -2.071567
H  -3.945608 -2.34049 -1.721075
H  2.575827 -1.667904 2.80537
H  -3.987282 -0.248237 2.092233
H  4.379968 -1.752668 -1.151933
H  -5.051772 -1.851439 0.4798
H  4.454131 -2.348215 1.285965
