program: Gaussian 09
title: 000199390
version: EM64L-G09RevD.01
frameworkgroup: C1[X(C14H8Cl2N2S)]
method: RPBEPBE
basis: SDD
operation: Freq
keyword: #p
keyword: freq=noraman
keyword: PBEPBE/SDD
title: #p freq=noraman PBEPBE/SDD
converged: NO YES NO NO
title: Mulliken charges:
elementType: Cl Cl S N N C C C C C C C C C C C C C C H H H H H H H H
charge: -0.032854 -0.050530 0.379465 -0.057147 -0.422243 0.553276 0.318381 -0.420272 0.084689 -0.368870 -0.348354 -0.360084 -0.321678 -0.202392 -0.212582 -0.209180 -0.216781 -0.114551 -0.102811 0.278132 0.237078 0.270416 0.276943 0.262776 0.262387 0.257813 0.258973
chargesum: 0.00000
title: Mulliken charges with hydrogens summed into heavy atoms:
elementType: Cl Cl S N N C C C C C C C C C C C C C C
charge: -0.032854 -0.050530 0.379465 -0.057147 -0.422243 0.553276 0.318381 -0.420272 0.084689 -0.090739 -0.111276 -0.089668 -0.044735 0.060384 0.049805 0.048633 0.042192 -0.114551 -0.102811
polarizability: 4.02647160e+02 9.98452394e-01 2.10269928e+02 -8.98247475e-02 5.10410760e-02 7.17699703e+01
1716.lowfreq: -10.5642 -0.0022 -0.0019 0.0009 1.3539 3.1700 27.7644 31.7558 42.4890
frequency: 27.7533 31.7086 42.4890 58.1850 65.8189 124.2731 150.3532 188.9869 195.0834 242.0249 259.7862 290.0037 310.7788 323.0622 367.3589 404.3060 410.8086 423.0980 458.8388 473.6142 495.9856 507.8114 593.0849 610.9087 623.6895 639.0406 657.7300 689.9000 703.6860 719.8771 724.4465 736.8362 826.4136 838.8460 846.0720 849.0704 854.2744 924.4647 958.3083 976.7977 984.0537 985.8785 999.1569 1000.7642 1066.9484 1073.1404 1077.6728 1106.1447 1115.8568 1179.3094 1187.6515 1227.9997 1261.3285 1294.3893 1297.3183 1366.5384 1371.2471 1393.0895 1402.9382 1404.8841 1456.4820 1489.6010 1518.6006 1573.8250 1581.4272 1598.8774 1603.3474 3132.1197 3158.9085 3160.6735 3161.9104 3176.4965 3176.8777 3180.6694 3180.8927
redmass: 3.8769 4.9978 13.1881 10.1423 9.9749 9.9060 9.8895 12.0516 9.7984 11.5623 13.5566 6.8284 8.1324 7.5494 5.7725 2.8855 2.9311 8.5651 9.8640 3.7959 3.1581 9.4108 5.4129 8.0274 7.1786 10.2241 11.0461 5.8077 7.7240 3.5770 8.5161 4.0837 1.3218 1.2477 1.4907 1.5414 8.8941 8.4130 1.3724 1.3573 1.3634 1.3600 4.2999 3.9913 6.5378 2.6701 2.4591 1.3554 1.3901 1.1171 1.1256 4.3581 5.1798 1.3426 1.2621 5.2904 5.9425 4.8916 3.9811 3.6071 2.7453 3.2563 6.6714 7.6587 8.0510 6.1399 6.2921 1.0905 1.0889 1.0886 1.0888 1.0954 1.0968 1.0978 1.0977
irintensity: 0.0002 0.0032 0.0759 0.0914 0.2969 0.8155 1.8983 0.3869 0.9383 2.4143 1.9927 0.6914 0.2065 3.7538 3.4874 0.0081 0.0006 19.2827 19.7855 4.3690 34.5617 22.5961 0.7624 7.3246 1.1962 13.9710 0.3141 11.3540 1.3330 1.3288 11.9523 19.2329 14.6436 0.0922 1.4803 116.2567 20.7829 51.1925 0.1382 1.2112 1.3520 0.0003 99.3922 4.4641 22.7186 136.5947 4.8019 5.6285 13.0244 27.4230 5.2960 30.0598 24.8084 4.8346 4.7471 5.8088 74.8490 140.2956 13.4375 40.5581 223.2182 8.4753 49.6599 5.4473 4.9540 117.7374 19.4081 6.2993 0.6561 0.9740 0.1724 1.7757 3.5165 2.9267 1.6815
temp: 298.150 k
press: 1.00000 atm
elementType: 17 17 16 7 7 6 6 6 6 6 6 6 6 6 6 6 6 6 6 1 1 1 1 1 1 1 1
symmnumber: 1
zpe: 475949.8 jmol-1
zpe.correction: 0.181280 hartree
zpe.thermalcorrener: 0.197376 hartree
zpe.thermalcorrenthalpy: 0.198321 hartree
zpe.thermalcorrgfe: 0.134580 hartree
zpe.sumelectzpe: -1964.673028 hartree
zpe.sumelectthermal: -1964.656931 hartree
zpe.sumelectthermalent: -1964.655987 hartree
zpe.sumelectthermalfe: -1964.719728 hartree
dipole: -2.4403 -0.0486 0.0004
dipole: 2.4408
quadrupole: -139.2464 -123.5092 -135.2705
quadrupole: -2.6038 -0.0291 0.0476
quadrupole: -6.5710 9.1662 -2.5951 -2.6038 -0.0291 0.0476
hfenergy: -1964.8543078 hartree
pointgroup: C01 [X(C14H8Cl2N2S1)]
dipole: -0.9602206 0.0100323 0.0011351 debye
polarizability: 402.6469559|0.779109|208.7153054|-0.8065857|-14.5847746|73.3247977 unknown
InChI: InChI=1S/C14H8Cl2N2S/c15-11-5-1-9(2-6-11)13-17-14(19-18-13)10-3-7-12(16)8-4-10/h1-8H
charge 0 multiplicity 1
27 atoms
Cl -6.750059 1.531615 -0.12583
Cl 6.692926 1.609643 -0.166389
S  -0.761078 -2.613544 0.307353
N  -0.010736 -0.09726 0.029979
N  0.993021 -2.247232 0.260073
C  -2.48804 -0.271556 0.055988
C  2.481626 -0.302492 0.0448
C  -1.12823 -0.811837 0.110268
C  1.135556 -0.90531 0.112155
C  -2.671253 1.13331 -0.087241
C  -3.63179 -1.111456 0.14185
C  2.622068 1.101998 -0.107118
C  3.642597 -1.116583 0.131382
C  -3.963935 1.68704 -0.143244
C  -4.930337 -0.568911 0.087292
C  3.902081 1.690836 -0.17247
C  4.925651 -0.539187 0.067404
C  -5.07771 0.826049 -0.054989
C  5.035226 0.858846 -0.083939
H  -1.787895 1.775042 -0.152784
H  -3.516309 -2.196556 0.250349
H  1.723063 1.721313 -0.172805
H  3.528233 -2.198413 0.248114
H  -4.106282 2.765727 -0.252716
H  -5.810165 -1.21446 0.152979
H  4.015555 2.772212 -0.289233
H  5.82292 -1.160635 0.13367
