program: Gaussian 09
title: 000199387
version: EM64L-G09RevD.01
frameworkgroup: C1[X(C13H17N5O2)]
method: RPBEPBE
basis: SDD
operation: Freq
keyword: #p
keyword: freq=noraman
keyword: PBEPBE/SDD
title: #p freq=noraman PBEPBE/SDD
converged: YES YES NO NO
title: Mulliken charges:
elementType: O O N N N N N C C C C C C C C C C C C C H H H H H H H H H H H H H H H H H
charge: -0.242355 -0.239026 -0.329490 -0.138852 -0.086791 -0.086954 -0.586081 -0.562865 0.529495 -0.396032 -0.534023 -0.463801 0.206996 0.192862 -0.332569 0.114037 -0.541656 -0.538939 0.061342 -0.308752 0.231025 0.211453 0.224397 0.260844 0.265477 0.230223 0.332816 0.240245 0.227407 0.220977 0.244522 0.219154 0.217552 0.246353 0.243084 0.330500 0.337426
chargesum: 0.00000
title: Mulliken charges with hydrogens summed into heavy atoms:
elementType: O O N N N N N C C C C C C C C C C C C C
charge: -0.242355 -0.239026 0.003326 -0.138852 -0.086791 -0.086954 0.081846 -0.120388 0.529495 0.089209 -0.268545 -0.233577 0.206996 0.192862 -0.092324 0.114037 0.151250 0.144120 0.061342 -0.065669
polarizability: 2.50956694e+02 1.61015302e+01 2.10721785e+02 2.91260966e+01 -5.44868491e+00 1.10370691e+02
1716.lowfreq: -10.4667 -4.8027 -0.0009 -0.0009 -0.0007 3.0854 9.4347 19.3618 23.5245
frequency: 8.6613 18.5038 23.3941 56.5065 69.3752 93.9570 106.1769 143.1633 162.4202 178.1024 181.4865 203.0172 217.0983 233.6158 255.4111 285.8109 325.5790 345.8507 359.4601 379.9001 426.8209 443.5374 452.4093 469.3382 495.6482 497.4178 535.6383 554.2868 562.7421 577.7306 590.5252 622.1246 636.5412 690.6468 715.9066 730.2008 738.0084 780.4846 798.1306 804.5045 849.6088 867.3306 879.7395 910.3201 915.5475 925.1664 961.5652 963.8198 985.3094 1003.4345 1022.7109 1031.7717 1110.7493 1112.1835 1120.0467 1130.5918 1141.8893 1157.6857 1171.0580 1179.8533 1221.2882 1232.7676 1255.9499 1261.7903 1274.0496 1281.8285 1316.2050 1348.3337 1355.5302 1382.1939 1394.4491 1409.0826 1435.9758 1439.3663 1444.7679 1456.2148 1465.8828 1466.3393 1467.6092 1470.9009 1472.4247 1491.3561 1507.2284 1526.1599 1566.3456 1589.4620 1610.9205 1617.7096 2954.0187 2955.1462 2992.0227 3010.1420 3040.5994 3041.8713 3053.8509 3093.1078 3123.8889 3124.6488 3126.7946 3150.1106 3152.1919 3162.6551 3550.4348 3553.8705 3713.9090
redmass: 5.1911 5.0546 4.8501 4.4851 4.1917 3.5354 3.6815 5.7055 4.4650 3.9338 4.9146 2.4049 3.2384 1.3098 1.5013 2.1472 3.4559 3.1560 3.5519 3.0068 3.6640 2.4962 3.7885 3.4364 1.9689 1.9008 4.4711 1.0350 6.5529 3.7548 1.6219 2.4826 3.8193 4.7211 10.3921 4.9440 3.2255 3.6044 10.9016 1.5583 1.9376 2.1546 4.3438 8.4395 1.3799 2.8935 1.4705 3.4699 7.9177 3.2680 1.9902 2.3626 1.2649 1.2611 2.8056 2.0661 1.6146 1.3891 1.4475 1.3658 2.0705 2.8215 2.5557 3.6013 2.6434 1.5531 1.3262 1.4395 1.4167 1.8864 3.8709 2.9966 1.1802 1.6639 1.4155 1.4487 1.1166 1.0508 1.0517 1.0942 1.0593 2.8965 2.6793 3.0510 3.1104 7.0389 6.4139 2.0629 1.0332 1.0334 1.0601 1.0647 1.1037 1.1038 1.1006 1.1015 1.0980 1.0989 1.0900 1.0905 1.0929 1.0937 1.0750 1.0456 1.1058
irintensity: 0.4011 0.8719 1.7127 0.4380 7.6030 9.8128 0.4744 1.0433 0.7361 4.1013 3.2411 0.9471 0.1177 1.7400 2.2350 1.3365 2.0846 0.6472 4.1688 1.5358 10.5899 51.5447 5.4248 9.6477 124.3604 99.3195 8.9939 5.8764 3.1993 3.5534 126.8700 77.5037 13.4019 1.0834 2.6451 19.7406 1.3850 17.1130 38.7834 34.1044 8.3193 13.8936 5.7754 9.9813 0.3007 1.4768 5.2500 1.4619 36.9871 31.2393 7.2345 20.9064 0.7528 0.2299 5.9494 142.1967 10.8858 9.2658 14.2926 7.5869 119.8530 19.8130 6.8982 145.8307 32.1526 11.5578 26.6427 13.5620 64.9137 84.2721 7.5273 15.7234 12.3345 77.1633 28.5938 13.4142 10.0908 11.1888 17.0779 83.8958 23.2723 158.7254 157.5728 362.9204 956.9950 64.9013 41.9564 237.3319 125.2943 5.6221 32.5009 31.1767 39.2948 57.2618 34.5037 7.2035 29.3168 28.5642 3.0631 13.8162 26.6826 13.0555 59.8186 94.2363 49.9857
temp: 298.150 k
press: 1.00000 atm
elementType: 8 8 7 7 7 7 7 6 6 6 6 6 6 6 6 6 6 6 6 6 1 1 1 1 1 1 1 1 1 1 1 1 1 1 1 1 1
symmnumber: 1
zpe: 776208.4 jmol-1
zpe.correction: 0.295642 hartree
zpe.thermalcorrener: 0.315016 hartree
zpe.thermalcorrenthalpy: 0.315960 hartree
zpe.thermalcorrgfe: 0.244681 hartree
zpe.sumelectzpe: -928.296495 hartree
zpe.sumelectthermal: -928.277121 hartree
zpe.sumelectthermalent: -928.276177 hartree
zpe.sumelectthermalfe: -928.347456 hartree
dipole: -1.5832 0.5499 -1.1463
dipole: 2.0305
quadrupole: -112.4166 -104.2879 -118.2786
quadrupole: 18.0592 3.0493 0.1411
quadrupole: -0.7555 7.3731 -6.6176 18.0592 3.0493 0.1411
hfenergy: -928.592137 hartree
pointgroup: C01 [X(C13H17N5O2)]
dipole: -0.6083651 -0.2055706 0.4751647 debye
polarizability: 250.7422115|-16.9206124|208.7785808|-30.5221596|-11.8441837|112.5283776 unknown
InChI: InChI=1S/C13H17N5O2/c1-19-10-4-3-9(7-11(10)20-2)5-6-15-13-17-8-16-12(14)18-13/h3-4,7-8,15H,5-6,14H2,1-2H3
charge 0 multiplicity 1
37 atoms
O  -2.272718 -2.261916 -0.298057
O  -4.57451 -1.205844 0.494325
N  1.382892 1.171551 0.813706
N  2.900044 -0.604565 0.812951
N  3.380111 1.455989 -0.423797
N  5.009968 -0.356796 -0.408851
N  4.509395 -2.309668 0.790882
C  -0.168559 2.283723 -0.843462
C  -1.364513 1.400712 -0.524406
C  0.81155 2.446232 0.3602
C  -1.246382 -0.015155 -0.603411
C  -2.592812 1.948532 -0.09875
C  -2.318875 -0.863754 -0.256113
C  -3.560511 -0.29324 0.175855
C  -3.682284 1.111156 0.246287
C  2.580439 0.666806 0.386461
C  -1.012503 -2.874888 -0.726435
C  -5.857543 -0.648413 0.924262
C  4.120619 -1.057309 0.394277
C  4.56139 0.875653 -0.769881
H  0.407329 1.876763 -1.695742
H  -0.507624 3.296888 -1.132898
H  0.279909 2.91072 1.211177
H  1.649865 3.097548 0.064143
H  -0.303222 -0.446639 -0.953331
H  -2.711684 3.036801 -0.039006
H  0.807905 0.533557 1.367954
H  -4.625301 1.56441 0.566444
H  -0.174357 -2.589341 -0.060118
H  -0.763946 -2.598683 -1.769938
H  -1.189043 -3.958483 -0.661782
H  -6.313155 -0.023186 0.131132
H  -5.749025 -0.049647 1.850254
H  -6.495519 -1.522583 1.12008
H  5.224318 1.46613 -1.410867
H  3.902745 -2.854058 1.398567
H  5.417209 -2.656804 0.491888
