program: Gaussian 09
title: 000199410
version: EM64L-G09RevD.01
frameworkgroup: C1[X(C20H26O3)]
method: RPBEPBE
basis: SDD
operation: Freq
keyword: #pfreq=noraman
keyword: PBEPBE/SDD
title: #p freq=noraman PBEPBE/SDD
converged: YES YES NO NO
title: Mulliken charges:
elementType: O O O C C C C C C C C C C C C C C C C C C C C H H H H H H H H H H H H H H H H H H H H H H H H H H
charge: -0.458551 -0.215831 -0.268128 -0.119292 -0.108874 -0.080426 -0.160692 -0.194104 -0.605601 -0.505814 -0.137594 -0.477694 -0.510446 0.257321 -0.581153 0.303260 0.136446 -0.373349 -0.549505 -0.793950 -0.416163 0.319664 -0.535883 0.242069 0.254172 0.225093 0.209625 0.273203 0.224563 0.228314 0.205002 0.201703 0.243299 0.221310 0.198068 0.215818 0.217008 0.223062 0.227070 0.336979 0.215802 0.254840 0.248705 0.240458 0.251277 0.238202 0.218528 0.219229 0.242963
chargesum: 0.00000
title: Mulliken charges with hydrogens summed into heavy atoms:
elementType: O O O C C C C C C C C C C C C C C C C C C C C
charge: -0.121572 -0.215831 -0.268128 0.122777 0.145298 0.144667 0.048933 0.079099 -0.152724 -0.099109 0.105705 -0.058316 -0.077620 0.257321 -0.131022 0.303260 0.136446 -0.157547 -0.294665 -0.053510 -0.177962 0.319664 0.144837
polarizability: 2.99806989e+02 -4.99206559e+00 2.11640653e+02 5.10832143e+00 1.15572605e+01 1.51022531e+02
1716.lowfreq: -5.3491 -0.0009 -0.0008 -0.0007 5.7044 7.3537 23.4303 28.0636 42.1514
frequency: 23.4175 28.0322 42.1477 57.8604 71.8236 88.5938 97.3304 124.7466 154.7347 165.8614 169.0947 189.4431 214.4836 217.3686 239.8050 244.1188 260.6296 292.9147 303.4135 316.7348 335.1985 361.2106 387.3614 402.8386 420.7732 441.2876 443.5257 457.5545 486.7454 496.2407 510.6509 538.0782 553.3307 577.7714 586.1249 619.1270 622.8157 667.4275 710.1855 718.8833 775.7347 808.4849 817.7552 833.8547 848.6600 852.1829 876.4024 890.4740 892.3017 907.3226 926.4747 931.3484 952.0705 966.2346 979.3473 991.7907 999.3801 1007.2651 1018.6363 1036.5987 1049.2608 1064.3954 1082.9644 1093.6144 1101.3417 1111.2458 1115.4247 1127.1571 1142.1412 1145.0638 1146.0848 1159.6038 1166.4862 1180.4335 1183.5809 1186.4365 1199.2804 1208.3371 1226.2713 1232.6235 1241.6360 1251.8610 1260.1867 1273.8932 1278.0830 1283.7274 1298.3164 1303.0855 1312.5893 1317.0934 1323.0400 1327.7706 1332.6567 1339.1298 1354.8082 1356.1610 1365.3444 1367.1506 1371.7139 1377.1519 1422.0318 1436.5038 1442.6733 1450.4176 1453.3833 1455.7710 1461.0964 1465.1044 1465.3305 1470.4013 1474.0973 1493.9268 1576.1581 1624.0989 1624.3401 2902.9027 2930.8450 2940.3285 2954.1736 2955.5005 2958.6635 2962.7627 2972.5870 2975.9791 2977.4029 2982.7738 3006.5802 3014.6059 3020.7850 3022.7056 3036.6601 3041.4845 3045.7341 3056.8166 3057.8791 3119.9102 3121.1741 3131.9985 3137.4968 3160.0459 3561.4680
redmass: 4.6131 4.2756 3.9668 3.5726 3.7350 5.1026 3.7741 3.8696 1.0481 3.2451 3.3841 3.5673 2.1743 1.9696 3.1156 2.0328 2.3613 2.2886 1.4000 3.0712 2.9891 4.2474 3.5924 3.6520 3.3906 2.9072 3.1840 3.4676 2.8602 3.1211 2.9108 3.8533 3.3052 3.2776 3.6730 2.5630 3.3388 3.6609 4.7539 3.3571 2.2019 1.6393 2.4845 2.1259 2.2300 2.0670 3.3289 2.0383 2.5913 2.5187 2.1596 1.3944 2.3339 1.8342 2.1004 2.2154 2.9435 3.5423 1.8265 2.3768 2.6154 2.8143 1.9128 2.3007 2.4014 1.2628 2.2682 1.6236 1.9030 1.5138 1.5186 1.7464 1.5170 1.4382 1.2520 1.5631 1.5813 1.7892 1.4307 1.3830 1.6660 2.1768 1.4344 1.3745 1.3851 1.3358 1.2825 1.3158 1.4568 1.4020 1.4140 1.4083 1.4697 1.4278 1.5211 1.4582 1.2756 1.5224 2.2974 3.0851 3.1112 1.2642 1.0756 1.0537 1.0961 1.1278 1.0851 1.0973 1.0508 1.0907 1.0748 2.4922 7.2135 7.3770 6.8300 1.0795 1.0805 1.0819 1.0786 1.0332 1.0646 1.0655 1.0633 1.0371 1.0638 1.0642 1.0849 1.0849 1.0941 1.0979 1.1014 1.1038 1.1005 1.1010 1.0957 1.1004 1.0990 1.0872 1.0912 1.0949 1.0660
irintensity: 0.4234 0.3608 5.6624 0.8795 1.9418 1.8660 5.7528 0.2501 0.3067 5.8589 0.0735 1.8660 2.4684 1.0564 1.7699 3.9763 13.0654 26.4376 120.5521 1.0115 4.8950 7.7510 0.6207 0.1169 6.6575 3.9284 9.6485 6.5165 4.1705 2.1655 0.2317 2.0305 5.4479 4.1485 13.6354 4.2156 2.7440 3.8214 2.8541 2.0671 17.7864 16.1544 11.8955 0.7482 7.0660 1.3955 5.9103 12.7818 25.0827 2.0655 11.9527 0.3157 37.4765 13.4250 14.9519 15.1485 25.0037 40.1606 1.5696 3.4928 7.7850 1.0821 6.5091 11.5529 16.1310 0.2104 15.6238 18.4764 2.3494 9.1765 2.0603 18.1470 50.0033 16.9669 11.1679 15.1324 24.6479 69.5554 13.1520 12.1702 53.4423 57.5242 22.5496 33.5990 3.5164 8.2154 3.9864 16.6579 27.9593 30.2607 0.4576 4.4437 0.6927 2.3798 6.4113 3.4554 43.5783 45.7784 11.8801 4.8312 26.4092 1.9991 19.6385 15.1497 5.8178 14.0009 11.4755 2.6658 12.8169 5.0768 50.9213 113.3231 23.9908 114.6774 63.8424 12.7590 4.6625 5.3006 11.7902 76.8289 27.0780 47.5165 43.0730 2.2814 30.7286 21.7442 30.4994 22.1050 43.5268 42.1797 48.8650 51.9745 55.0019 33.6026 11.1963 20.6746 31.4520 15.4383 4.8992 18.9254 3.8250
temp: 298.150 k
press: 1.00000 atm
elementType: 8 8 8 6 6 6 6 6 6 6 6 6 6 6 6 6 6 6 6 6 6 6 6 1 1 1 1 1 1 1 1 1 1 1 1 1 1 1 1 1 1 1 1 1 1 1 1 1 1
symmnumber: 1
zpe: 1092033.5 jmol-1
zpe.correction: 0.415934 hartree
zpe.thermalcorrener: 0.437666 hartree
zpe.thermalcorrenthalpy: 0.438610 hartree
zpe.thermalcorrgfe: 0.364664 hartree
zpe.sumelectzpe: -1001.660425 hartree
zpe.sumelectthermal: -1001.638693 hartree
zpe.sumelectthermalent: -1001.637749 hartree
zpe.sumelectthermalfe: -1001.711695 hartree
dipole: 1.4992 -0.6389 -1.8585
dipole: 2.4718
quadrupole: -137.9184 -121.9885 -147.3454
quadrupole: -13.4998 7.1199 5.5354
quadrupole: -2.1677 13.7623 -11.5946 -13.4998 7.1199 5.5354
hfenergy: -1002.0763588 hartree
pointgroup: C01 [X(C20H26O3)]
dipole: -0.5870931 -0.2406906 0.7369445 debye
polarizability: 299.5944856|6.6283859|211.1452633|5.426974|-13.1319968|151.7304243 unknown
InChI: InChI=1S/C20H26O3/c1-11(21)20-17-8-7-15-14-6-4-13(23-2)9-12(14)3-5-16(15)18(17)10-19(20)22/h4,6,9,15-20,22H,3,5,7-8,10H2,1-2H3
charge 0 multiplicity 1
49 atoms
O  4.700031 1.882456 1.19086
O  5.054668 -0.905587 -1.779856
O  -6.204044 -0.071273 -0.369412
C  1.740109 0.890145 0.280284
C  2.406423 -0.462566 -0.076952
C  0.258396 0.903366 -0.139782
C  -0.48496 -0.264864 0.579669
C  3.914966 -0.201389 0.247471
C  2.710841 1.900956 -0.366764
C  1.703036 -1.637343 0.619204
C  4.121088 1.31858 -0.05102
C  0.191707 -1.630507 0.264267
C  -0.46155 2.23589 0.154785
C  -1.997116 -0.241678 0.29686
C  -1.872154 2.224622 -0.467648
C  -2.648987 0.944782 -0.164971
C  4.841805 -1.114009 -0.552478
C  -2.80142 -1.381178 0.542603
C  -4.04564 0.945062 -0.368821
C  5.471018 -2.287483 0.18228
C  -4.198751 -1.387993 0.339434
C  -4.825126 -0.207562 -0.125307
C  -7.04652 -1.243598 -0.12915
H  1.793832 1.019915 1.384712
H  2.319063 -0.598177 -1.177739
H  0.209213 0.722827 -1.238058
H  -0.349999 -0.0875 1.672894
H  4.081407 -0.344652 1.332066
H  2.55399 1.920258 -1.463909
H  2.604105 2.932429 0.015007
H  1.828299 -1.54468 1.718584
H  2.145076 -2.608423 0.320675
H  4.818678 1.470956 -0.897371
H  0.060621 -1.855554 -0.813801
H  -0.30466 -2.445766 0.821909
H  0.115966 3.088124 -0.251456
H  -0.527694 2.380627 1.252869
H  -1.776328 2.329763 -1.568816
H  -2.456001 3.100561 -0.125501
H  4.918841 2.835923 1.034221
H  -2.336119 -2.302511 0.908671
H  -4.554911 1.849539 -0.72056
H  6.168651 -1.90771 0.954086
H  4.697602 -2.871605 0.716644
H  6.018095 -2.93823 -0.51741
H  -4.771399 -2.297148 0.545305
H  -7.009049 -1.558237 0.932448
H  -6.751198 -2.093181 -0.776014
H  -8.0673 -0.922078 -0.383704
