program: Gaussian 09
title: 000199409
version: EM64L-G09RevD.01
frameworkgroup: C1[X(C23H30O3)]
method: RPBEPBE
basis: SDD
operation: Freq
keyword: #pfreq=noraman
keyword: PBEPBE/SDD
title: #p freq=noraman PBEPBE/SDD
converged: YES YES NO NO
title: Mulliken charges:
elementType: O O O C C C C C C C C C C C C C C C C C C C C C C C H H H H H H H H H H H H H H H H H H H H H H H H H H H H H H
charge: -0.206993 -0.200175 -0.268184 0.364721 -0.198649 -0.125632 -0.058579 -0.494578 -0.519948 -0.209273 -0.506118 -0.474092 -0.173979 -0.835465 -0.485411 0.236063 -0.591331 -0.582176 -0.353419 0.314881 -0.367946 0.178076 -0.558351 -0.408509 0.321514 -0.535935 0.213565 0.222316 0.201293 0.207960 0.222145 0.215565 0.199923 0.220091 0.201876 0.227521 0.228708 0.192121 0.275170 0.223064 0.220859 0.211373 0.202688 0.220322 0.221578 0.226459 0.250246 0.267401 0.221247 0.233712 0.234784 0.256529 0.239412 0.218924 0.219205 0.243432
chargesum: 0.00000
title: Mulliken charges with hydrogens summed into heavy atoms:
elementType: O O O C C C C C C C C C C C C C C C C C C C C C C C
charge: -0.206993 -0.200175 -0.268184 0.364721 0.014916 0.096683 0.142714 -0.064473 -0.104460 0.010818 -0.076721 -0.053263 0.101191 -0.180170 -0.062401 0.236063 -0.143293 -0.064529 0.101540 0.314881 -0.133162 0.178076 -0.301822 -0.169098 0.321514 0.145627
polarizability: 3.26432531e+02 -7.81040780e+00 2.39538481e+02 4.22409873e+00 -2.42870941e+00 1.81420346e+02
1716.lowfreq: -2.9233 -0.0009 -0.0006 0.0002 6.4102 7.9020 21.3359 38.9171 55.9538
frequency: 19.1124 38.9096 55.9494 69.2046 74.5853 96.3307 99.7533 128.9448 150.6168 169.9140 185.1836 191.1978 203.8536 216.2830 225.4370 235.1793 243.4506 259.6496 266.8972 283.9056 290.7716 319.2194 336.1019 368.4658 384.9639 409.7159 419.0791 451.5730 455.3978 462.5515 491.0492 509.7868 516.2941 529.4865 539.9350 556.5377 565.4396 595.5771 605.5932 631.5818 641.1417 662.5232 710.3020 719.2474 729.7345 750.2468 794.7334 804.1562 814.0503 842.8602 855.0129 868.5819 872.0937 879.2001 892.1887 894.8761 905.0556 914.5268 935.3897 937.9249 951.4274 979.8517 991.0263 1001.0636 1003.3617 1008.6706 1015.6318 1022.6421 1047.0022 1053.7998 1071.3951 1082.2958 1088.2924 1096.2072 1110.3227 1111.6059 1118.6893 1123.8564 1129.7113 1135.1606 1144.6079 1147.7670 1159.8595 1172.2160 1178.2873 1180.6020 1191.4354 1206.5468 1212.7568 1217.2286 1230.3781 1240.9367 1245.7630 1247.6147 1256.4838 1271.7021 1273.8684 1283.7452 1288.5663 1296.0648 1297.7473 1302.9687 1307.6986 1318.0388 1325.5113 1329.2119 1334.2696 1335.5280 1345.2701 1355.0522 1362.6449 1365.5835 1377.6027 1386.4289 1424.9565 1437.2890 1442.1519 1457.0352 1465.6553 1467.8109 1470.2471 1473.2477 1473.7506 1474.5817 1478.7672 1481.2359 1485.8870 1493.1565 1496.3627 1578.1466 1625.3906 1708.6530 2925.1929 2939.9546 2948.2551 2955.7883 2957.6637 2965.8417 2968.7192 2973.8551 2975.9105 2980.5427 2982.8256 2987.0871 2990.0520 2995.7630 3008.9973 3021.6205 3026.2147 3035.2196 3040.1497 3041.9333 3046.2724 3057.1833 3058.7560 3062.3197 3096.4751 3104.4686 3121.6728 3123.6892 3139.1299 3160.6937
redmass: 6.2084 4.0569 4.1872 5.2746 3.4802 3.4129 3.9060 3.9248 3.3158 3.7664 2.7536 3.3321 2.6978 1.7931 1.8731 1.6369 2.2088 2.1614 1.7680 2.5757 2.8331 2.6387 3.5104 3.2523 2.7632 3.1588 3.2920 3.5832 3.1947 4.0633 3.4010 3.3526 2.6023 3.1558 4.0309 3.4846 2.8454 2.4329 3.8032 3.0875 6.2550 3.9370 5.0196 2.5054 3.1646 2.6367 4.4244 1.4921 2.1399 1.9068 2.5852 2.4863 1.9554 2.3090 1.5896 1.6877 2.2018 2.2396 1.5617 2.0754 3.9632 1.7475 2.0979 3.2473 2.3208 2.1278 2.2319 2.0343 1.9861 2.1986 2.0582 2.5551 2.6559 2.6200 2.0164 1.2660 3.2527 2.5590 1.6767 1.7860 1.5182 1.6736 1.5197 1.5087 1.4695 1.4053 1.5080 1.9055 1.5820 1.5271 1.6349 1.4426 1.7630 1.4585 2.3012 1.3201 1.3732 1.3815 1.3259 1.3099 1.2930 1.3195 1.3624 1.3375 1.3865 1.3439 1.4378 1.3449 1.4840 1.4770 1.6214 1.6866 4.3462 1.1980 2.9745 1.2889 1.0836 1.1225 1.0502 1.0889 1.0750 1.0614 1.0724 1.0797 1.0844 1.0922 1.0830 1.0983 2.3723 7.3281 6.8162 12.5924 1.0795 1.0811 1.0821 1.0332 1.0648 1.0375 1.0828 1.0606 1.0616 1.0631 1.0655 1.0646 1.0696 1.0689 1.0771 1.0948 1.0942 1.1022 1.1017 1.1038 1.0972 1.0992 1.1001 1.0999 1.0955 1.1023 1.0965 1.0906 1.0914 1.0941
irintensity: 1.2183 1.0671 1.5455 1.5702 4.0502 5.7462 1.4905 1.0830 3.4488 0.1914 0.2690 0.6196 2.4904 0.8098 1.1980 0.4747 1.2280 0.3491 0.3711 0.8188 0.6871 2.2117 0.5388 1.2191 1.6583 0.1751 1.8463 2.0455 3.5795 1.0953 1.9196 1.1567 2.2559 2.3084 7.5426 1.9063 1.2715 1.9671 6.9296 11.4259 5.9152 1.3504 2.7551 7.7784 1.3517 2.5779 29.9557 31.4112 2.3937 2.5742 0.6090 2.4263 16.3755 4.2017 1.2605 20.3285 5.7683 0.6826 3.8852 11.6593 85.8590 11.2703 5.4966 31.9105 13.1994 25.6966 24.8346 13.9870 6.4577 2.6167 0.3078 8.7320 41.5660 32.1681 31.1621 0.9423 2.5527 27.8320 15.5050 15.4240 11.1351 3.3725 10.4800 13.9571 27.9750 6.9875 1.6883 18.5084 6.0007 3.8599 9.7074 29.3403 36.5803 8.2634 66.6281 4.5234 8.0695 0.7994 1.3019 1.0216 6.4641 1.5819 0.2833 1.5125 1.2316 2.6135 0.3914 0.8795 3.6399 1.3553 1.0052 0.9532 8.7917 17.7062 30.1982 1.7061 13.6346 11.9357 12.7981 2.2338 3.5234 12.3331 44.8222 6.1500 0.2707 14.7066 7.9451 26.6289 105.1057 19.3231 72.8297 429.3496 8.1486 15.4845 17.9846 76.8893 27.6943 16.8203 29.2270 54.2614 24.7248 41.2114 47.8512 29.4377 2.7095 31.6200 52.6367 36.2793 30.7488 40.5341 53.6051 53.3834 40.2859 33.8551 67.7025 55.0919 7.1897 20.5736 43.9175 3.2782 6.5460 15.8307
temp: 298.150 k
press: 1.00000 atm
elementType: 8 8 8 6 6 6 6 6 6 6 6 6 6 6 6 6 6 6 6 6 6 6 6 6 6 6 1 1 1 1 1 1 1 1 1 1 1 1 1 1 1 1 1 1 1 1 1 1 1 1 1 1 1 1 1 1
symmnumber: 1
zpe: 1262275.0 jmol-1
zpe.correction: 0.480775 hartree
zpe.thermalcorrener: 0.504125 hartree
zpe.thermalcorrenthalpy: 0.505069 hartree
zpe.thermalcorrgfe: 0.428646 hartree
zpe.sumelectzpe: -1118.157886 hartree
zpe.sumelectthermal: -1118.134536 hartree
zpe.sumelectthermalent: -1118.133592 hartree
zpe.sumelectthermalfe: -1118.210015 hartree
dipole: 4.4354 2.5897 0.4780
dipole: 5.1583
quadrupole: -200.3100 -153.1619 -157.1039
quadrupole: -36.7655 -3.0366 -0.6780
quadrupole: -30.1181 17.0300 13.0880 -36.7655 -3.0366 -0.6780
hfenergy: -1118.6386614 hartree
pointgroup: C01 [X(C23H30O3)]
dipole: 1.75719 -0.9982526 -0.1853511 debye
polarizability: 326.2331846|8.8441122|239.7266313|-4.1945996|-2.6203499|181.4315422 unknown
InChI: InChI=1S/C23H30O3/c1-23-10-9-18-17-6-4-16(25-2)11-14(17)3-5-19(18)21(23)8-7-20(23)15-12-22(24)26-13-15/h4,6,11,15,18-21H,3,5,7-10,12-13H2,1-2H3
charge 0 multiplicity 1
56 atoms
O  -5.254458 2.065897 -0.737393
O  -6.680977 2.326411 1.079527
O  6.531606 1.276272 0.196181
C  -1.792467 -1.148158 -0.837547
C  -0.775217 -2.107879 -0.070537
C  -2.612205 -0.46027 0.323396
C  0.714668 -1.715851 -0.290068
C  -1.223187 -2.117289 1.427269
C  -1.009739 -0.144019 -1.731297
C  0.936387 -0.206032 -0.007237
C  -2.658418 -1.546841 1.428939
C  0.091386 0.665805 -1.000617
C  -4.005369 0.10665 -0.023899
C  -2.71036 -2.00507 -1.749077
C  1.694146 -2.5770 0.537643
C  2.420663 0.185029 0.023516
C  3.147244 -2.283769 0.113143
C  -4.754837 0.721987 1.186154
C  -4.005986 1.295911 -1.021744
C  3.460996 -0.790093 0.10419
C  2.789027 1.552303 0.012558
C  -5.691605 1.77176 0.57848
C  4.808436 -0.372735 0.159029
C  4.134174 1.977036 0.066396
C  5.153848 0.997339 0.137148
C  6.9323 2.683737 0.175697
H  -0.901698 -3.132653 -0.475983
H  -1.998572 0.381038 0.715955
H  0.958201 -1.898922 -1.359811
H  -0.572961 -1.458381 2.034989
H  -1.163452 -3.124929 1.874994
H  -1.706732 0.555504 -2.231992
H  -0.539156 -0.724921 -2.549667
H  0.541569 -0.019504 1.015896
H  -3.395048 -2.330783 1.16068
H  -2.954148 -1.142442 2.414035
H  0.759279 1.107427 -1.763997
H  -0.360131 1.519092 -0.457174
H  -4.635905 -0.700562 -0.443747
H  -2.096747 -2.581476 -2.466552
H  -3.308908 -2.732709 -1.169739
H  -3.408518 -1.384164 -2.341982
H  1.470155 -3.652948 0.394239
H  1.569895 -2.359516 1.61703
H  3.312931 -2.693015 -0.905829
H  3.860604 -2.809456 0.776056
H  -4.056071 1.240191 1.873422
H  -5.332557 -0.000444 1.782497
H  -3.147425 1.974705 -0.856741
H  -4.054247 1.004265 -2.081538
H  2.005339 2.317518 -0.037414
H  5.617231 -1.109494 0.221914
H  4.366911 3.045966 0.055772
H  6.526665 3.232726 1.048242
H  6.606481 3.183085 -0.757971
H  8.031162 2.671466 0.224764
