program: Gaussian 09
title: 000199376
version: EM64L-G09RevD.01
frameworkgroup: C1[X(C21H28N2O)]
method: RPBEPBE
basis: SDD
operation: Freq
keyword: #p
keyword: freq=noraman
keyword: PBEPBE/SDD
title: #p freq=noraman PBEPBE/SDD
converged: YES YES NO NO
title: Mulliken charges:
elementType: O N N C C C C C C C C C C C C C C C C C C C C C H H H H H H H H H H H H H H H H H H H H H H H H H H H H
charge: -0.478943 -0.084997 -0.062412 -0.103682 -0.419415 0.029850 -0.340740 -0.355161 -0.393087 -0.382033 -0.758054 0.356401 0.399526 -0.614092 -0.396344 -0.373193 -0.404965 -0.409726 -0.223844 -0.247676 -0.256917 -0.225854 -0.245931 -0.244350 0.205313 0.218364 0.207463 0.190204 0.189774 0.205400 0.185449 0.186344 0.204899 0.204898 0.186284 0.240844 0.224203 0.229466 0.348632 0.221922 0.187622 0.222640 0.273201 0.235102 0.231814 0.284798 0.225792 0.222025 0.226706 0.222230 0.229389 0.224858
chargesum: 0.00000
title: Mulliken charges with hydrogens summed into heavy atoms:
elementType: O N N C C C C C C C C C C C C C C C C C C C C C
charge: -0.130311 -0.084997 -0.062412 0.101631 0.006412 0.029850 0.039238 0.035688 -0.001844 0.009150 -0.063541 0.356401 0.399526 0.018092 -0.123143 -0.138091 -0.173151 -0.124928 0.001948 -0.025651 -0.030211 -0.003624 -0.016542 -0.019492
polarizability: 2.65618526e+02 -1.54334830e+01 2.38152506e+02 -7.56433044e+00 8.65859135e+00 2.09284990e+02
1716.lowfreq: -19.6167 -10.3993 -0.0002 0.0003 0.0004 3.7598 17.3197 29.3810 33.7913
frequency: 11.4898 29.1801 33.5601 38.4385 43.7313 62.3957 79.8788 98.6843 142.8611 158.7275 179.8154 209.2277 221.9386 228.9924 238.3868 255.8228 262.3285 277.7250 281.3695 308.1043 318.6551 322.0235 344.8949 365.8847 380.0881 396.4742 402.4944 405.5758 422.6633 430.3644 472.3160 488.5497 523.1425 540.5276 598.1416 616.3390 616.7451 631.9379 646.4138 702.8094 705.5148 708.4789 753.2401 758.9707 773.8497 787.2997 848.5761 854.5496 857.7277 868.4522 876.5102 899.9677 921.2602 926.7325 937.7391 941.5290 976.2188 979.8020 981.9808 990.2230 990.7524 998.3964 999.8671 1007.2311 1023.3218 1028.3991 1030.5398 1047.7914 1056.0930 1068.9693 1078.6226 1082.3888 1106.5054 1114.9176 1121.2866 1132.8675 1142.9309 1148.3634 1149.5806 1159.0423 1171.2660 1172.7569 1185.5150 1189.4598 1191.6915 1193.0763 1215.1660 1269.1528 1270.2592 1278.3801 1292.8319 1301.0197 1304.8281 1311.9552 1318.4795 1324.8250 1335.2713 1348.1242 1362.5659 1373.0448 1374.6698 1377.3959 1381.2555 1391.4354 1428.3642 1432.4403 1435.1510 1451.9607 1452.6176 1459.4137 1462.3863 1473.3207 1475.2081 1478.5282 1480.0695 1480.2321 1482.5983 1487.4200 1587.7724 1591.4132 1607.9150 1612.1730 2845.5350 2847.6650 2856.0274 2860.9953 2864.9839 2875.9187 2986.9232 2988.1129 3005.1624 3016.7368 3023.9636 3027.5652 3029.8282 3034.1633 3074.6725 3085.5239 3093.6490 3118.8820 3122.4087 3127.6109 3130.8015 3140.5015 3145.1973 3153.3619 3157.6404 3165.3258 3178.5242 3565.5052
redmass: 3.3447 3.5230 4.1299 4.0125 3.7420 4.5264 4.1237 3.0453 3.9739 3.3523 4.8916 4.0552 1.1915 3.0950 1.8444 1.6381 1.7546 3.3655 4.1475 2.5209 1.9075 2.0859 2.2003 2.1723 2.6091 2.3003 2.8533 2.7517 3.0730 4.1394 3.0577 2.8361 3.3332 4.0455 2.4229 6.3399 6.4074 5.1257 3.4373 2.3284 2.8046 1.6464 3.6382 1.8315 2.0953 2.9706 1.5450 1.2568 1.2531 2.9286 2.8937 1.7963 1.8595 1.5084 1.7244 1.8634 1.9593 1.6107 1.4158 5.8410 5.0235 1.3256 1.3719 2.3711 2.5273 2.1846 2.1894 1.6289 1.8524 1.7323 1.7128 1.5833 1.9198 1.9388 2.4327 2.1752 2.2660 2.8395 2.1110 2.1856 1.0564 1.0530 2.4164 1.1765 1.1696 1.1249 1.9557 1.5757 1.3456 1.6658 1.4227 1.6114 1.3356 1.3562 1.3503 1.4152 1.2958 1.3468 1.4160 1.4057 1.3654 5.0547 8.1115 1.4054 1.1710 2.2085 2.2434 1.0790 1.0787 1.0755 1.0790 1.0986 1.1101 2.0329 1.0551 2.0992 1.0856 1.0706 6.0781 6.2964 6.0684 6.0780 1.0708 1.0633 1.0675 1.0693 1.0657 1.0666 1.0444 1.0725 1.0886 1.0729 1.0891 1.0915 1.0867 1.0884 1.1009 1.0994 1.1001 1.0845 1.0844 1.0881 1.0877 1.0939 1.0919 1.0950 1.0991 1.1009 1.0950 1.0656
irintensity: 0.1493 0.0942 0.1253 0.2355 0.1022 0.0310 0.8947 0.5389 0.9057 1.8672 0.7107 1.5677 0.0215 0.1457 0.3744 1.7716 1.8269 9.1777 20.3094 23.8484 28.3529 29.1747 14.9385 50.6304 27.4692 0.2355 0.2684 12.7212 0.8466 3.3572 2.4166 0.2417 4.0404 1.1504 5.4527 0.0348 0.0605 17.8598 20.0325 17.2088 27.1537 72.8450 11.3613 40.9827 44.1655 19.1590 0.0744 0.5551 0.7238 7.3783 10.5027 5.5844 9.7419 4.2324 9.2122 30.5682 22.9699 9.3020 2.0182 0.9626 3.1515 0.4266 1.3034 46.1833 1.7986 14.7150 3.7132 8.4864 7.0878 4.4049 1.1106 1.6888 7.1772 35.3275 9.0742 36.8712 14.2454 69.5956 14.8144 10.5884 0.5062 0.0875 10.3453 2.9448 0.3817 0.3988 6.2179 9.4914 1.0482 21.6499 19.2319 7.7436 2.4817 8.5102 2.0414 20.0579 7.2492 6.9251 2.6274 7.9923 12.7317 1.1876 1.6947 9.8528 1.7237 3.2246 21.2684 1.4766 0.8987 41.6354 11.3762 9.8230 14.3004 19.9007 7.5594 19.2557 5.9515 1.1701 1.2359 0.6596 9.1915 4.6127 84.8816 32.4145 81.1236 9.9374 26.9069 361.6222 22.3882 3.0642 31.7052 46.6845 17.8374 81.4586 93.6303 3.4458 34.7463 16.7037 26.9622 3.1557 1.6735 5.5772 5.6599 36.6486 29.7874 24.2395 31.2429 18.9882 7.3046 5.8946
temp: 298.150 k
press: 1.00000 atm
elementType: 8 7 7 6 6 6 6 6 6 6 6 6 6 6 6 6 6 6 6 6 6 6 6 6 1 1 1 1 1 1 1 1 1 1 1 1 1 1 1 1 1 1 1 1 1 1 1 1 1 1 1 1
symmnumber: 1
zpe: 1166130.4 jmol-1
zpe.correction: 0.444156 hartree
zpe.thermalcorrener: 0.467203 hartree
zpe.thermalcorrenthalpy: 0.468147 hartree
zpe.thermalcorrgfe: 0.390038 hartree
zpe.sumelectzpe: -999.921377 hartree
zpe.sumelectthermal: -999.898330 hartree
zpe.sumelectthermalent: -999.897386 hartree
zpe.sumelectthermalfe: -999.975495 hartree
dipole: -1.5132 1.0725 0.5318
dipole: 1.9294
quadrupole: -140.4047 -143.0635 -135.7698
quadrupole: 2.8542 -0.4924 -0.0803
quadrupole: -0.6587 -3.3175 3.9762 2.8542 -0.4924 -0.0803
hfenergy: -1000.365533 hartree
pointgroup: C01 [X(C21H28N2O1)]
dipole: -0.5952516 0.3645832 0.2983171 debye
polarizability: 265.6119465|-13.2699392|233.0295115|-10.9787786|13.990632|214.4145644 unknown
InChI: InChI=1S/C21H28N2O/c1-18(17-23-15-13-22(2)14-16-23)21(24,19-9-5-3-6-10-19)20-11-7-4-8-12-20/h3-12,18,24H,13-17H2,1-2H3
charge 0 multiplicity 1
52 atoms
O  1.381919 0.1590 -2.13861
N  -2.667569 -0.361991 -0.533208
N  -5.411291 -0.152516 0.395222
C  -0.1651 -0.724677 -0.40651
C  -1.338974 0.103416 -1.001816
C  1.218053 -0.021291 -0.67081
C  -2.982953 0.052271 0.856387
C  -3.764671 0.046805 -1.446662
C  -4.319444 -0.558072 1.310454
C  -5.099222 -0.566285 -0.993106
C  -0.20207 -2.160882 -0.973226
C  1.368776 1.359225 0.016439
C  2.376775 -0.938292 -0.228983
C  -6.731743 -0.631523 0.844371
C  2.32263 2.271725 -0.508867
C  2.590859 -1.1888 1.150021
C  0.64719 1.736871 1.177183
C  3.221205 -1.560252 -1.178874
C  2.540112 3.526151 0.099661
C  3.624254 -2.052685 1.572061
C  0.864137 2.992275 1.789369
C  4.260482 -2.420539 -0.75606
C  1.809777 3.894341 1.253574
C  4.465316 -2.673976 0.619099
H  -0.292632 -0.79297 0.691845
H  -1.195704 1.193737 -0.79334
H  -1.319395 -0.028277 -2.102031
H  -3.045577 1.167076 0.943094
H  -2.183585 -0.300793 1.533605
H  -3.526177 -0.309199 -2.466334
H  -3.877844 1.160019 -1.482586
H  -4.208623 -1.672471 1.350478
H  -4.559867 -0.200306 2.32955
H  -5.910574 -0.216389 -1.658995
H  -5.031252 -1.681118 -1.083983
H  -1.235723 -2.542966 -0.908346
H  0.113689 -2.164002 -2.032537
H  0.464492 -2.841349 -0.416784
H  0.779635 0.892822 -2.421255
H  -6.94209 -0.245771 1.858327
H  -6.812551 -1.748273 0.875264
H  -7.515929 -0.251291 0.165025
H  2.900413 1.979782 -1.392208
H  1.962769 -0.695187 1.900907
H  -0.094864 1.061055 1.615466
H  3.056086 -1.36009 -2.240431
H  3.283203 4.213077 -0.321356
H  3.778843 -2.233832 2.641933
H  0.291945 3.264449 2.683683
H  4.908461 -2.894529 -1.502487
H  1.977231 4.867473 1.72856
H  5.270774 -3.341773 0.945325
