program: Gaussian 09
title: 000199400
version: EM64L-G09RevD.01
frameworkgroup: C1[X(C24H30N4O2)]
method: RPBEPBE
basis: SDD
operation: Freq
keyword: #p
keyword: freq=noraman
keyword: PBEPBE/SDD
title: #p freq=noraman PBEPBE/SDD
converged: YES YES NO NO
title: Mulliken charges:
elementType: O O N N N N C C C C C C C C C C C C C C C C C C C C C C C C H H H H H H H H H H H H H H H H H H H H H H H H H H H H H H
charge: -0.247410 -0.256744 -0.081922 -0.175240 -0.214073 -0.436115 -0.351176 -0.370211 -0.351954 -0.385849 -0.406507 -0.444507 -0.362368 -0.364556 0.470930 -0.376664 -0.363444 -0.377441 -0.382384 0.157808 -0.235487 -0.226659 0.140894 0.110018 -0.269773 0.339935 -0.309072 -0.391815 -0.256053 -0.190373 0.207531 0.183476 0.187547 0.212400 0.202246 0.187588 0.215343 0.203434 0.214726 0.210107 0.204614 0.205724 0.227729 0.189288 0.193455 0.193564 0.221090 0.226559 0.244774 0.245292 0.232361 0.215447 0.217306 0.217450 0.224330 0.341542 0.275696 0.234412 0.238095 0.235086
chargesum: 0.00000
title: Mulliken charges with hydrogens summed into heavy atoms:
elementType: O O N N N N C C C C C C C C C C C C C C C C C C C C C C C C
charge: -0.247410 -0.256744 -0.081922 -0.175240 -0.214073 -0.094573 0.039832 0.029737 0.037880 0.032928 0.018326 -0.034169 0.054649 0.022462 0.470930 0.070985 0.126622 -0.145079 -0.166938 0.157808 -0.018181 -0.009209 0.140894 0.110018 -0.045443 0.339935 -0.033376 -0.157403 -0.017958 0.044713
polarizability: 3.29971579e+02 -9.22218099e+00 3.38713041e+02 1.79029811e+01 -2.44620128e+01 2.24709004e+02
1716.lowfreq: -6.7886 -3.7119 -0.0010 -0.0003 0.0004 2.4866 4.9902 9.9704 18.4015
frequency: -0.9363 9.4301 18.0847 23.3778 27.3616 42.4506 55.7070 63.3090 86.5022 91.6680 99.1723 110.3436 124.8207 138.4676 154.6048 162.5279 199.4370 220.1774 238.2305 260.7144 266.3135 270.0180 279.0482 300.5408 312.7770 345.6135 352.1760 383.7890 390.9974 409.0910 414.8768 430.0853 440.3101 445.1715 471.5536 487.4551 509.4054 516.5865 530.9708 547.2067 550.9361 614.1612 617.7478 625.2983 632.0684 664.4791 680.1638 690.2787 711.6892 718.1156 724.0429 728.0320 736.6612 755.9387 760.6803 763.4768 783.1901 811.9439 820.5955 843.8080 867.1763 872.2236 873.9077 886.7815 900.1850 914.3522 940.0413 952.4379 955.0432 969.6217 974.3575 977.6637 985.1332 998.6345 1017.3343 1024.6009 1030.6966 1032.4535 1049.5850 1053.0795 1060.9306 1069.3187 1078.3307 1085.5477 1089.0873 1102.7295 1103.6144 1115.3310 1142.2564 1153.6063 1163.5864 1170.5995 1172.0386 1189.6378 1200.5108 1201.3069 1211.1617 1222.6419 1230.2219 1239.4644 1251.6883 1256.0391 1265.8298 1274.8123 1280.9471 1282.7897 1291.5271 1299.1131 1305.7969 1325.5409 1338.0462 1340.3323 1344.2415 1344.7002 1350.5978 1359.5375 1360.8739 1366.5174 1376.6453 1379.6215 1384.9681 1388.4394 1393.0965 1418.2422 1442.6520 1446.2651 1450.2051 1457.4813 1459.8750 1463.7426 1466.3463 1467.3918 1473.4415 1475.3052 1481.0749 1483.4066 1487.1824 1496.2582 1578.5844 1582.6706 1604.6760 1618.2245 1628.3685 1654.1174 2835.7951 2842.9152 2857.4735 2907.7259 2919.5576 2951.7532 2963.8339 2971.7981 2988.0380 2996.2878 2998.4544 3015.9877 3031.1172 3034.7957 3040.8980 3047.9455 3053.7815 3054.4688 3090.2100 3104.5346 3119.8635 3126.6241 3130.5712 3147.2420 3147.9189 3157.0794 3158.8152 3168.3968 3175.5443 3554.5295
redmass: 5.2901 6.3268 3.8134 5.5153 5.1631 4.6402 3.1593 2.8960 4.3228 2.1721 5.8599 3.4938 2.4315 4.2509 3.8426 6.0833 3.0071 2.7134 2.1159 4.2927 3.7595 4.2698 3.9865 2.9368 2.9184 3.6054 2.9158 7.1775 2.1551 2.8894 3.5000 3.6798 3.6884 8.9552 2.7036 4.0917 3.8475 2.9671 3.4561 9.6912 3.0065 5.6303 2.7885 1.3320 4.8452 6.8895 4.0171 1.7831 4.3252 3.2036 1.5299 5.5708 1.3063 1.9068 1.5681 2.1336 2.0051 1.2902 1.5186 1.5678 1.9391 1.5040 1.4619 4.4994 3.1329 3.4194 2.0015 2.4249 1.3839 1.3691 1.3108 5.2396 1.8091 1.3323 2.6897 3.2939 2.2305 2.2022 2.3656 1.9211 2.3546 2.1526 2.3597 2.3122 1.6738 2.1862 2.7306 1.9969 2.8053 2.8803 2.8764 1.0589 1.1076 2.0528 1.1784 1.3749 1.5430 1.5662 2.3131 1.4386 1.6934 1.4620 1.3502 1.9763 1.2843 1.1617 1.1505 1.2755 1.3320 1.3740 1.4589 1.3618 1.4004 1.4725 1.8444 1.7114 1.6078 1.5008 1.6912 1.7389 3.0943 2.9990 1.4805 2.8967 1.1160 2.3945 1.0958 1.0947 1.1009 1.0770 1.0740 1.1057 1.0977 1.1087 3.2320 2.8660 1.1007 2.3684 5.9259 7.7693 8.9961 6.0632 6.9281 5.8055 1.0706 1.0713 1.0693 1.0691 1.0709 1.0588 1.0632 1.0620 1.0597 1.0931 1.0929 1.0960 1.0890 1.0581 1.1018 1.0900 1.1021 1.0904 1.0888 1.1064 1.0842 1.0884 1.0875 1.0899 1.0921 1.0943 1.0939 1.0994 1.1002 1.0774
irintensity: 0.1230 0.0799 0.4429 0.5978 1.0786 0.6592 1.6816 0.6920 0.9774 0.0774 0.5549 1.0151 0.4848 2.5650 3.2806 1.2876 1.4488 2.3457 1.1589 0.9546 6.3901 1.6275 1.6152 13.1547 1.5161 7.6144 8.3217 13.6559 3.0345 1.2566 3.4507 2.1234 5.6221 5.1373 0.7874 3.1141 0.9793 20.5518 15.1119 1.9979 3.6012 0.6650 4.4273 57.2277 4.2811 9.1568 7.3720 42.0924 11.6180 4.6645 8.6366 26.3071 10.9157 73.8465 8.0610 83.3591 34.6449 1.6243 3.8313 0.4567 0.5285 5.3319 1.0624 1.5470 1.9511 15.9206 23.9481 11.7510 0.1445 2.8354 0.4987 9.5984 22.8257 0.1977 43.4827 0.5975 15.8640 5.3990 5.6263 1.8574 18.4866 1.9658 0.6668 2.3550 5.9153 6.4972 8.8253 3.4251 67.8393 24.9063 20.7447 0.6322 1.6083 3.9571 2.5145 7.1825 23.7624 22.9423 36.4319 134.0151 13.5564 36.1879 1.8658 6.4847 12.4321 8.9726 5.6140 13.4786 14.2506 3.2669 58.8346 8.0370 4.9259 58.8397 107.2779 1.1770 27.4858 1.3978 49.3046 49.6215 14.2655 37.1101 1.1487 45.2428 40.6396 0.4319 5.3165 2.7062 14.6192 6.7100 9.0216 52.3529 0.5959 8.1095 52.5301 21.6364 25.4764 128.2131 9.8174 155.3802 234.4878 165.9745 119.4281 469.5163 44.3617 50.5576 204.2510 64.7501 103.6188 18.2974 3.1149 66.6135 25.2977 4.6897 22.2004 19.4995 49.0103 24.7896 29.5085 42.2140 61.0749 52.0192 23.1635 5.2424 9.2614 9.5125 4.6474 9.9720 39.5764 42.6297 7.2269 6.4950 19.4089 57.7961
temp: 298.150 k
press: 1.00000 atm
elementType: 8 8 7 7 7 7 6 6 6 6 6 6 6 6 6 6 6 6 6 6 6 6 6 6 6 6 6 6 6 6 1 1 1 1 1 1 1 1 1 1 1 1 1 1 1 1 1 1 1 1 1 1 1 1 1 1 1 1 1 1
symmnumber: 1
zpe: 1319074.8 jmol-1
zpe.correction: 0.502409 hartree
zpe.thermalcorrener: 0.529104 hartree
zpe.thermalcorrenthalpy: 0.530048 hartree
zpe.thermalcorrgfe: 0.441602 hartree
zpe.sumelectzpe: -1299.829187 hartree
zpe.sumelectthermal: -1299.802492 hartree
zpe.sumelectthermalent: -1299.801548 hartree
zpe.sumelectthermalfe: -1299.889994 hartree
dipole: 3.5849 0.2436 1.8357
dipole: 4.0350
quadrupole: -158.7843 -174.9209 -174.9106
quadrupole: 26.0025 9.1265 2.0002
quadrupole: 10.7543 -5.3823 -5.3720 26.0025 9.1265 2.0002
hfenergy: -1300.331596 hartree
pointgroup: C01 [X(C24H30N4O2)]
dipole: -1.4202197 0.1273271 -0.6977625 debye
polarizability: 330.3841369|8.6936686|336.0357069|16.8801932|29.9833413|226.9737797 unknown
InChI: InChI=1S/C24H30N4O2/c29-23-21-12-6-7-13-22(21)25-24(30)28(23)15-9-2-1-8-14-26-16-18-27(19-17-26)20-10-4-3-5-11-20/h3-7,10-13,25H,1-2,8-9,14-19H2
charge 0 multiplicity 1
60 atoms
O  -3.584196 0.822672 1.862875
O  -5.229298 -2.567856 -0.941845
N  3.362583 -2.095665 -0.364131
N  5.382391 -0.015583 -0.181329
N  -4.408681 -0.878486 0.483124
N  -6.255856 -0.480818 -0.963201
C  4.440015 -1.988412 -1.376124
C  3.878083 -1.641997 0.948149
C  2.769253 -3.457203 -0.322589
C  4.924608 -0.534668 -1.491633
C  4.372669 -0.185517 0.880964
C  1.442868 -3.533919 0.464882
C  0.343916 -2.602998 -0.091103
C  -0.970657 -2.670949 0.71658
C  6.271593 1.08802 -0.129367
C  -2.058307 -1.725558 0.160103
C  -3.357128 -1.802883 0.990849
C  6.178226 2.079246 0.896142
C  7.327256 1.226845 -1.083995
C  -4.42819 0.45381 0.994486
C  7.106308 3.140055 0.968096
C  8.24078 2.295741 -1.006919
C  -5.290232 -1.386147 -0.501293
C  -5.484069 1.33582 0.446855
C  8.146194 3.264479 0.020795
C  -6.389791 0.846814 -0.534981
C  -5.595257 2.674789 0.896196
C  -7.399094 1.694406 -1.059814
C  -6.594377 3.518352 0.379781
C  -7.49488 3.020876 -0.599957
H  4.041199 -2.312491 -2.355542
H  5.311793 -2.645156 -1.12077
H  4.720253 -2.294883 1.296872
H  3.070976 -1.699292 1.699652
H  2.574636 -3.759555 -1.37084
H  3.493803 -4.201559 0.100816
H  4.085899 0.089003 -1.877868
H  5.745117 -0.487474 -2.223858
H  4.827745 0.063374 1.855144
H  3.498896 0.488929 0.721966
H  1.616406 -3.304857 1.535886
H  1.09309 -4.586286 0.434022
H  0.728221 -1.565059 -0.10615
H  0.14126 -2.871965 -1.148943
H  -0.764019 -2.409236 1.775734
H  -1.352612 -3.713558 0.718439
H  -2.281796 -1.994025 -0.890509
H  -1.682795 -0.684375 0.168506
H  -3.773668 -2.823221 0.955715
H  -3.157049 -1.513908 2.036354
H  5.368235 2.044758 1.630203
H  7.457734 0.481504 -1.874976
H  7.002244 3.883329 1.767617
H  9.042292 2.364664 -1.752058
H  8.861018 4.091869 0.077577
H  -6.886943 -0.860877 -1.671382
H  -4.880906 3.018749 1.651104
H  -8.096645 1.316697 -1.816289
H  -6.679802 4.552068 0.728181
H  -8.274812 3.674371 -1.005694
