program: Gaussian 09
title: 000199345
version: EM64L-G09RevD.01
frameworkgroup: C1[X(C12H21N5)]
method: RPBEPBE
basis: SDD
operation: Freq
keyword: #pfreq=noraman
keyword: PBEPBE/SDD
title: #p freq=noraman PBEPBE/SDD
converged: YES YES NO NO
title: Mulliken charges:
elementType: N N N N N C C C C C C C C C C C C H H H H H H H H H H H H H H H H H H H H H
charge: -0.075211 -0.448405 -0.671954 -0.684410 0.004353 -0.359854 -0.373327 -0.395463 -0.388026 -0.398897 -0.313058 -0.439894 0.196346 0.295444 0.290781 -0.485940 -0.487832 0.170212 0.204141 0.217832 0.166010 0.206744 0.191329 0.193017 0.206183 0.215565 0.188326 0.232036 0.142299 0.215378 0.250496 0.270945 0.224362 0.221260 0.296750 0.328442 0.300536 0.293484
chargesum: 0.00000
title: Mulliken charges with hydrogens summed into heavy atoms:
elementType: N N N N N C C C C C C C C C C C C
charge: -0.075211 -0.177459 -0.046761 -0.090390 0.004353 0.014498 0.010515 0.002610 0.011174 0.004993 0.061277 0.025980 0.196346 0.295444 0.290781 -0.261578 -0.266573
polarizability: 1.89711950e+02 -7.81780351e+00 1.71089339e+02 2.19122717e+01 8.52615815e+00 1.37104156e+02
1716.lowfreq: -7.1430 -1.2079 -0.0009 -0.0008 -0.0008 11.8560 23.8809 37.0490 42.5759
frequency: 23.7402 35.7982 42.0542 69.5249 101.5460 121.4686 168.3947 194.1578 223.9928 240.9548 242.4895 289.4633 294.4856 311.3166 345.3239 366.0091 385.5646 399.5368 411.8860 421.4609 449.4167 471.8992 476.3933 487.6113 528.3517 555.4206 567.4432 589.7360 603.3673 611.8224 669.5805 746.2551 756.6042 781.4737 804.7877 818.8722 826.2814 850.6075 852.7307 854.9520 905.1659 959.0744 985.4592 992.7897 1017.1469 1027.4450 1043.7489 1048.2896 1068.6003 1098.3819 1108.7545 1121.5777 1139.0727 1151.8725 1160.7844 1165.8436 1194.2277 1247.8723 1255.0220 1264.3472 1269.1829 1290.6180 1296.1255 1311.1982 1316.0131 1331.0227 1341.8890 1346.4520 1348.1757 1352.3305 1352.8262 1367.5704 1386.2954 1434.7112 1438.3534 1453.1943 1455.2312 1461.6823 1465.5792 1467.4679 1472.0034 1480.5791 1511.7152 1552.4520 1578.1866 1608.0214 1626.8388 2786.5876 2813.6716 2829.9516 2967.2747 2986.3971 2986.7824 2995.8580 3022.4256 3029.2764 3030.6136 3036.6360 3046.9985 3055.9847 3071.6994 3103.9997 3112.7702 3483.5874 3522.6983 3529.9044 3674.0317 3679.1080
redmass: 4.4732 3.7309 3.8536 3.3435 3.8736 3.9631 2.5941 2.4670 3.3226 1.8245 3.0958 2.8898 1.7499 2.3299 2.4311 2.3202 1.9259 1.6145 1.2164 1.6263 2.8949 2.5951 2.9080 3.3619 1.5327 1.6125 2.4440 3.2398 3.7229 2.9072 3.5447 2.2940 2.9198 2.3804 1.5256 1.8072 1.9805 1.5170 1.7851 1.9631 2.3442 1.3038 2.1639 2.5709 2.1025 2.6214 2.3285 2.0686 2.0495 1.6368 2.2036 2.6174 1.8887 1.3970 2.3422 2.0932 1.5060 3.0731 1.3883 1.2449 1.3849 1.3467 1.2598 1.3675 1.3635 1.2998 1.4349 1.4608 3.2821 2.1672 1.5896 1.3736 1.3922 1.5425 2.6266 1.0896 1.0929 1.0871 1.0984 1.0841 1.0912 1.0978 3.9040 5.1527 2.9698 1.5326 1.2046 1.0706 1.0713 1.0698 1.0626 1.0615 1.0612 1.0628 1.0864 1.0872 1.0903 1.0925 1.1033 1.1035 1.1036 1.0885 1.0928 1.0748 1.0452 1.0454 1.1017 1.1019
irintensity: 1.6173 0.0636 0.2342 0.2486 0.1263 2.3205 2.6622 0.8778 1.1058 0.5321 3.0503 7.1639 59.3530 4.4801 14.6110 8.3914 83.3927 141.5869 6.0024 218.7096 0.3779 5.7049 19.1472 6.5321 61.3824 66.6608 7.6881 48.7395 3.4813 67.1756 10.3624 2.6206 12.5483 3.1436 0.3619 8.7459 54.5624 0.9898 2.2923 9.2853 1.8156 3.6790 2.6921 28.0957 19.0354 12.0231 2.1039 5.7353 26.9831 22.1289 25.3239 4.1895 12.2447 11.1643 36.1895 25.0452 19.8503 36.6014 14.5804 4.4162 16.8658 9.2236 19.8392 21.2879 8.8562 1.6248 1.0285 2.3354 18.9712 9.1495 3.2311 3.5724 1.4044 54.4686 29.1853 8.4601 2.7712 14.1476 10.1842 2.2233 6.7823 8.3526 68.4581 6.6625 21.1368 276.3294 112.0221 107.9521 58.4697 192.1447 38.2073 39.7877 34.0521 33.1934 1.9960 82.5453 66.3283 20.4388 16.6002 95.1474 27.3935 50.1146 12.5445 2.9529 34.0095 29.2685 39.2510 30.9394
temp: 298.150 k
press: 1.00000 atm
elementType: 7 7 7 7 7 6 6 6 6 6 6 6 6 6 6 6 6 1 1 1 1 1 1 1 1 1 1 1 1 1 1 1 1 1 1 1 1 1
symmnumber: 1
zpe: 861492.0 jmol-1
zpe.correction: 0.328125 hartree
zpe.thermalcorrener: 0.345270 hartree
zpe.thermalcorrenthalpy: 0.346214 hartree
zpe.thermalcorrgfe: 0.282645 hartree
zpe.sumelectzpe: -742.297071 hartree
zpe.sumelectthermal: -742.279926 hartree
zpe.sumelectthermalent: -742.278982 hartree
zpe.sumelectthermalfe: -742.342551 hartree
dipole: -4.4721 0.2863 -3.0156
dipole: 5.4014
quadrupole: -122.2839 -88.8348 -103.9304
quadrupole: 7.0327 -5.2820 5.0419
quadrupole: -17.2675 16.1816 1.0859 7.0327 -5.2820 5.0419
hfenergy: -742.6251961 hartree
pointgroup: C01 [X(C12H21N5)]
dipole: -1.7131685 -0.1918711 -1.2426429 debye
polarizability: 188.1651688|-2.4606259|172.9784445|24.9243213|0.9036316|136.7618326 unknown
InChI: InChI=1S/C12H21N5/c13-10-8-15-9-11(14)12(10)16-4-7-17-5-2-1-3-6-17/h8-9,16H,1-7,13-14H2
charge 0 multiplicity 1
38 atoms
N  -2.473662 -0.064164 -0.04913
N  1.082503 0.405303 -1.439384
N  2.293187 2.547879 -0.109919
N  1.986529 -2.286751 -0.760215
N  4.118022 -0.257973 1.511944
C  -3.414987 0.054883 -1.191695
C  -3.032219 -0.926736 1.024564
C  -4.765062 0.65029 -0.742271
C  -4.368723 -0.36045 1.546613
C  -5.384235 -0.19692 0.39251
C  -1.107627 -0.447479 -0.460792
C  -0.298005 0.753886 -1.022953
C  2.080536 0.147251 -0.441024
C  2.688502 1.255089 0.226087
C  2.529541 -1.167355 -0.115758
C  3.687666 0.995632 1.209331
C  3.561734 -1.311496 0.859213
H  -3.595692 -0.949915 -1.662226
H  -2.960954 0.700142 -1.965581
H  -2.294874 -0.977555 1.846955
H  -3.199545 -1.975251 0.658031
H  -4.595459 1.683717 -0.383558
H  -5.450756 0.702817 -1.610015
H  -4.771055 -1.031265 2.33003
H  -4.176751 0.62521 2.012763
H  -6.317947 0.268863 0.760331
H  -5.656069 -1.197938 -0.002939
H  -0.568163 -0.831291 0.425811
H  -1.116682 -1.273776 -1.225805
H  -0.820621 1.196083 -1.892276
H  -0.249086 1.529037 -0.238139
H  1.145133 -0.177427 -2.280634
H  4.163269 1.824018 1.749386
H  3.934308 -2.309006 1.126159
H  2.78409 3.347553 0.280043
H  1.757951 2.662339 -0.970401
H  2.310185 -3.21356 -0.495468
H  1.079017 -2.215987 -1.217284
