program: Gaussian 09
title: 000199361
version: EM64L-G09RevD.01
frameworkgroup: C1[X(C21H31NO)]
method: RPBEPBE
basis: SDD
operation: Freq
keyword: #p
keyword: freq=noraman
keyword: PBEPBE/SDD
title: #p freq=noraman PBEPBE/SDD
converged: NO YES NO NO
title: Mulliken charges:
elementType: O N C C C C C C C C C C C C C C C C C C C C C H H H H H H H H H H H H H H H H H H H H H H H H H H H H H H H
charge: -0.471748 -0.107313 -0.039775 -0.468472 -0.443711 -0.409307 -0.408027 0.040642 -0.384525 0.374498 -0.043465 -0.387081 -0.397055 -0.075444 -0.477987 -0.246641 -0.226987 -0.352571 -0.244994 -0.324899 -0.324354 -0.673151 -0.671524 0.211995 0.185094 0.225958 0.226226 0.212656 0.198496 0.193322 0.190082 0.198592 0.197449 0.189223 0.346920 0.236797 0.285920 0.230037 0.256825 0.221952 0.222816 0.212799 0.217987 0.224656 0.203694 0.192570 0.204129 0.190972 0.226593 0.208750 0.206858 0.226600 0.210716 0.207207
chargesum: 0.00000
title: Mulliken charges with hydrogens summed into heavy atoms:
elementType: O N C C C C C C C C C C C C C C C C C C C C C
charge: -0.124828 -0.107313 0.172220 -0.057420 -0.004830 -0.017489 -0.019352 0.040642 0.002147 0.374498 -0.043465 -0.150284 -0.111135 -0.075444 0.008875 -0.024689 -0.004171 0.078216 -0.020338 0.071365 0.070748 -0.030950 -0.027001
polarizability: 2.63845899e+02 -1.36001049e+01 2.49121719e+02 -1.26790103e+01 -6.27661941e+00 1.94736549e+02
1716.lowfreq: -22.0662 -11.3326 -5.8611 -0.0009 -0.0006 0.0003 3.3949 11.1297 23.9525
frequency: -12.4050 -10.1858 23.8394 34.8107 41.8248 54.3257 66.9403 71.0577 81.4472 83.3185 92.4486 126.7564 164.2049 198.8940 204.9055 212.2622 221.0605 230.1126 240.5365 263.0326 267.8790 283.2130 289.1020 304.3020 328.5933 333.9266 378.0303 393.9175 403.3686 412.7151 427.6564 433.2701 450.5567 468.6578 486.9012 509.8790 531.0434 566.3009 616.3754 647.2913 704.0877 719.7668 745.5215 760.4987 766.1589 786.8807 795.2796 799.5488 804.7536 848.6549 856.3053 857.7880 874.2480 894.0566 910.9821 922.4903 925.7879 935.1945 963.3743 980.0044 984.8629 990.3019 997.4092 1021.7074 1028.1877 1030.5988 1043.3979 1051.6133 1055.4866 1070.4874 1074.6165 1077.8001 1085.0203 1085.3970 1107.5563 1111.5264 1132.2415 1149.8991 1152.8907 1162.8875 1171.2223 1186.3089 1188.6406 1206.2370 1226.6049 1237.4573 1254.9143 1266.6248 1270.6391 1281.0407 1286.0963 1292.0519 1297.8747 1298.7419 1304.6632 1322.0067 1327.4314 1336.1088 1337.7485 1340.5411 1358.8513 1359.5998 1362.9095 1374.0044 1382.9825 1388.1074 1389.9283 1434.8551 1450.3474 1460.3757 1461.3837 1461.7932 1463.0400 1464.1534 1470.2421 1471.8631 1477.7770 1479.4288 1480.3807 1483.0292 1487.9907 1492.0803 1593.1373 1611.5916 2260.1185 2855.1417 2863.6543 2896.3625 2951.1967 2962.1439 2962.7009 2964.4798 2966.5079 2981.6953 2982.5362 2983.2321 2983.5088 3022.4475 3024.0843 3025.4138 3029.8545 3030.0597 3034.5028 3037.5219 3052.2012 3058.4236 3074.5277 3075.9354 3091.4852 3091.8094 3118.4837 3127.2931 3140.2382 3157.5131 3179.1554 3576.5752
redmass: 3.7274 3.2514 4.0705 3.3304 3.7407 3.9445 3.4742 3.1995 1.9837 2.7625 2.7985 3.1979 1.4998 1.5954 1.6627 3.3788 2.2370 1.6682 1.8040 3.0474 3.5370 2.1447 2.3868 2.9752 2.5592 2.5469 3.5426 4.5429 2.8650 3.3213 3.0543 3.1207 3.1652 3.1248 1.8273 3.4278 3.9917 4.9962 6.4208 5.6128 2.0427 2.6114 2.4815 1.8735 1.2854 1.4654 1.1324 1.2327 2.8290 1.8759 2.7751 1.3697 2.3154 1.3886 1.9714 1.7174 2.2565 2.3744 2.8799 1.3721 2.4199 6.1150 1.3244 3.5220 2.2347 1.7502 3.3710 1.2979 1.5213 2.5841 1.9220 1.4023 2.0636 1.7291 1.7464 2.5702 2.4075 1.8789 1.5337 2.8366 1.0588 1.4453 1.1660 2.2570 1.6095 1.4076 1.2947 1.2706 1.2577 1.1374 1.3029 1.2263 1.2758 1.3174 1.5662 1.4161 1.5053 1.4100 1.5075 1.4779 1.3176 1.4480 1.3292 1.3628 8.9950 1.2344 1.2330 2.2156 1.0809 1.0877 1.0535 1.0890 1.0545 1.0891 1.0829 1.0547 1.0950 1.0527 2.2702 1.0705 1.0724 1.0773 6.3848 6.0933 11.8510 1.0721 1.0717 1.0708 1.0655 1.0716 1.0676 1.0617 1.0656 1.0597 1.0359 1.0627 1.0359 1.0870 1.0965 1.0959 1.0967 1.0978 1.0876 1.1027 1.1015 1.0939 1.0984 1.0980 1.1003 1.1003 1.0847 1.0882 1.0941 1.0992 1.0952 1.0659
irintensity: 0.0481 0.1366 0.2080 0.0661 0.2143 0.0148 0.0913 0.7066 0.2289 0.6094 0.5436 1.4027 0.9012 4.5596 2.3900 4.8568 31.0791 107.2405 21.5631 6.0135 0.0974 6.6433 1.9603 15.6688 4.1401 9.5715 1.5230 2.7287 0.6071 17.4260 0.0368 1.0838 1.5131 9.3313 0.9723 6.3325 5.7166 12.9524 0.0305 13.1559 34.9949 55.8603 6.0154 33.0123 3.7949 0.4096 5.7979 9.7863 0.6118 5.1873 22.3358 3.1192 5.8222 9.1383 3.6014 4.7673 28.3560 17.2679 12.5498 0.3034 3.8234 0.2486 0.7213 14.9303 7.5466 5.9272 31.1811 0.7047 0.9317 64.2165 15.5681 1.2039 5.1746 0.9696 21.3173 0.0727 2.8394 38.7794 7.8385 20.4788 0.5372 3.7083 3.0507 38.7072 14.2298 6.9521 0.4199 6.4489 4.9338 1.2458 14.9194 21.6865 3.1047 11.7014 8.5285 6.3107 18.1140 4.8555 5.3019 9.3077 10.2573 3.3300 2.4324 1.5653 2.3842 19.6500 23.0933 18.8765 5.8785 1.2957 4.3828 7.8953 2.6747 8.3223 16.7333 1.6850 0.7283 1.6551 16.4223 17.9497 9.6491 11.9331 0.2655 6.6222 21.3038 32.3870 142.0106 88.6407 19.1097 5.8617 39.3172 44.9904 34.2441 26.0335 33.6240 16.5424 30.1772 21.5869 80.1576 89.9805 2.1160 1.8899 19.7020 72.4542 55.9591 28.5297 42.2271 81.2467 29.4268 53.3039 3.0098 5.7728 36.8594 29.5962 6.4809 7.5107
temp: 298.150 k
press: 1.00000 atm
elementType: 8 7 6 6 6 6 6 6 6 6 6 6 6 6 6 6 6 6 6 6 6 6 6 1 1 1 1 1 1 1 1 1 1 1 1 1 1 1 1 1 1 1 1 1 1 1 1 1 1 1 1 1 1 1
symmnumber: 1
zpe: 1232534.3 jmol-1
zpe.correction: 0.469448 hartree
zpe.thermalcorrener: 0.492899 hartree
zpe.thermalcorrenthalpy: 0.493843 hartree
zpe.thermalcorrgfe: 0.415827 hartree
zpe.sumelectzpe: -946.957585 hartree
zpe.sumelectthermal: -946.934134 hartree
zpe.sumelectthermalent: -946.933190 hartree
zpe.sumelectthermalfe: -947.011206 hartree
dipole: 1.6596 -0.8903 -0.4516
dipole: 1.9367
quadrupole: -134.0254 -134.5162 -138.9369
quadrupole: 1.7569 2.7267 -4.8062
quadrupole: 1.8008 1.3099 -3.1107 1.7569 2.7267 -4.8062
hfenergy: -947.4270328 hartree
pointgroup: C01 [X(C21H31N1O1)]
dipole: 0.6737252 -0.3492256 -0.0685645 debye
polarizability: 265.6807691|-15.2080258|239.5375204|-6.9416483|-20.5533277|202.4858771 unknown
InChI: InChI=1S/C21H31NO/c1-3-22(4-2)18-12-11-17-21(23,19-13-7-5-8-14-19)20-15-9-6-10-16-20/h5,7-8,13-14,20,23H,3-4,6,9-10,12,15-16,18H2,1-2H3
charge 0 multiplicity 1
54 atoms
O  -1.748999 0.140612 1.977816
N  4.934992 -0.112247 -0.03164
C  -2.367699 -1.179939 -0.062187
C  -2.129146 -2.548148 0.626071
C  -3.865401 -0.794104 0.011315
C  -3.018087 -3.654921 0.008787
C  -4.762414 -1.900879 -0.59349
C  -1.435984 -0.048843 0.532924
C  -4.51519 -3.273121 0.075504
C  -1.711404 1.304062 -0.152295
C  -0.010384 -0.422515 0.380917
C  -1.336404 1.492654 -1.505535
C  -2.361555 2.35277 0.538172
C  1.177117 -0.739808 0.257633
C  2.608982 -1.047856 0.104009
C  -1.614308 2.710841 -2.16277
C  -2.636702 3.574074 -0.119234
C  3.498373 0.229981 0.098503
C  -2.26793 3.758076 -1.47116
C  5.557878 -0.467102 1.273395
C  5.712968 0.905643 -0.789775
C  6.774303 -1.401204 1.126606
C  5.462184 0.842886 -2.308536
H  -2.08344 -1.281178 -1.131822
H  -2.3792 -2.461496 1.705207
H  -1.061422 -2.830861 0.552624
H  -4.040316 0.159642 -0.519307
H  -4.135162 -0.624271 1.072832
H  -2.840089 -4.615246 0.53102
H  -2.726578 -3.808152 -1.051294
H  -4.553447 -1.986046 -1.680714
H  -5.827251 -1.612946 -0.495661
H  -5.133074 -4.054473 -0.408567
H  -4.831268 -3.223889 1.138262
H  -1.329678 -0.608062 2.471904
H  -0.811231 0.692525 -2.040856
H  -2.635642 2.202612 1.585252
H  2.936088 -1.723243 0.919276
H  2.789724 -1.594861 -0.840738
H  -1.316958 2.84551 -3.209102
H  -3.13842 4.381657 0.426349
H  3.28602 0.826894 1.017612
H  3.195553 0.854796 -0.759708
H  -2.481899 4.705469 -1.978943
H  4.792059 -0.981006 1.884422
H  5.849399 0.449688 1.846412
H  6.785441 0.714198 -0.604056
H  5.507201 1.939954 -0.414077
H  6.478157 -2.331406 0.611235
H  7.585932 -0.933163 0.540582
H  7.186399 -1.659486 2.120116
H  5.723618 -0.157482 -2.695061
H  4.404348 1.039838 -2.561196
H  6.076244 1.598873 -2.833033
