program: Gaussian 09
title: 000199343
version: EM64L-G09RevD.01
frameworkgroup: C1[X(C19H21N)]
method: RPBEPBE
basis: SDD
operation: Freq
keyword: #pfreq=noraman
keyword: PBEPBE/SDD
title: #p freq=noraman PBEPBE/SDD
converged: NO YES NO NO
title: Mulliken charges:
elementType: N C C C C C C C C C C C C C C C C C C C H H H H H H H H H H H H H H H H H H H H H
charge: -0.091184 -0.081062 -0.569912 -0.555660 -0.506455 0.373495 0.414158 0.386513 0.399882 -0.446171 -0.470836 -0.490664 -0.475671 -0.483212 -0.240569 -0.238885 -0.238527 -0.237536 -0.624643 -0.617049 0.245727 0.269271 0.241332 0.231995 0.232445 0.197801 0.235526 0.247454 0.244632 0.240898 0.239445 0.222533 0.222082 0.222069 0.222300 0.230481 0.189254 0.220078 0.232337 0.218317 0.188012
chargesum: 0.00000
title: Mulliken charges with hydrogens summed into heavy atoms:
elementType: N C C C C C C C C C C C C C C C C C C C
charge: -0.091184 0.164665 -0.300641 -0.314328 -0.042015 0.373495 0.414158 0.386513 0.399882 -0.012844 -0.223382 -0.246032 -0.234773 -0.243767 -0.018036 -0.016802 -0.016458 -0.015236 0.015170 0.021617
polarizability: 2.18709051e+02 2.00366832e+01 2.10417978e+02 -1.74462410e+01 1.36522246e+01 1.69167598e+02
1716.lowfreq: -10.4626 -6.7491 -0.0002 0.0004 0.0007 7.4252 34.0790 35.9729 63.2206
frequency: 34.0482 35.8786 63.2131 78.6189 124.6790 137.1505 150.8347 190.6722 222.0112 234.6924 245.6866 284.5129 316.2255 347.6409 349.0046 368.2092 371.4739 418.7422 440.7708 445.8485 476.9577 504.1291 510.6275 549.2269 578.0648 605.0131 622.8257 641.9615 709.4800 752.4487 757.5291 760.1735 772.0066 782.6528 795.2511 811.3624 830.2517 845.8699 875.1278 880.9491 900.3493 923.3200 939.5436 943.0827 947.7955 982.0099 982.7995 999.9066 1021.3743 1023.4079 1030.8319 1035.1076 1051.7243 1069.5892 1087.6229 1096.6751 1116.4091 1131.2765 1148.1898 1160.1735 1169.5019 1170.4646 1171.1352 1183.3446 1195.2546 1206.3215 1209.7460 1217.4145 1218.7903 1254.7586 1264.8521 1280.8150 1291.2316 1299.8189 1317.6295 1330.5536 1337.6175 1363.1061 1392.5021 1396.0335 1417.9641 1438.0284 1443.0216 1450.7698 1459.7601 1461.6807 1463.2071 1463.9931 1473.4260 1476.6570 1481.9990 1486.0321 1591.8231 1597.5996 1611.9738 1620.3594 2824.7809 2844.0026 2859.8660 2990.6106 2999.9292 3016.6673 3021.9008 3025.5897 3044.3373 3057.0678 3069.1569 3076.5924 3082.5135 3115.9798 3116.3787 3122.6598 3123.9546 3136.7911 3137.5965 3157.1048 3157.5495
redmass: 3.3037 3.1392 4.5472 3.4408 3.3136 3.7269 3.9235 2.3690 1.3907 1.3034 2.6131 2.0904 3.3882 4.0959 2.7022 3.7536 2.0874 3.9762 2.9390 2.5578 4.0802 4.3041 4.2221 3.5868 3.7557 4.0148 4.5737 6.4501 4.9082 1.6349 3.0904 1.5501 2.6316 3.8543 2.8819 3.9234 2.4652 3.0443 1.4124 1.7460 3.0771 2.3495 1.8334 1.4479 1.7867 1.3156 1.3167 2.1914 2.3873 2.2370 2.1496 1.5723 3.9614 2.1589 1.3755 1.7972 1.6680 1.3576 1.4455 1.3610 1.0810 1.3521 1.7901 1.7945 1.4043 1.7171 1.7601 1.5374 1.9710 1.9374 2.3153 1.5561 1.4886 1.4216 1.4294 1.4034 1.4083 1.3815 7.3109 5.7592 1.1415 1.1475 2.3645 2.4736 1.1404 1.0501 2.1418 1.1596 1.0711 1.0507 2.4608 1.0581 6.1458 7.1470 6.9633 7.1414 1.0701 1.0573 1.0577 1.0627 1.0814 1.0722 1.0886 1.0719 1.0878 1.1022 1.0880 1.1010 1.1005 1.0854 1.0854 1.0894 1.0891 1.0941 1.0942 1.1003 1.1003
irintensity: 0.1882 0.3004 0.5357 0.4954 0.5231 0.0494 0.1184 0.3465 0.4308 0.6756 0.1495 2.9867 0.6656 1.4953 4.5289 0.9752 3.2787 0.9905 2.4832 0.8185 4.2673 1.2187 1.9733 34.8803 0.1915 1.3996 8.4944 3.8689 2.9462 14.6762 7.1684 86.0534 23.1488 3.0239 10.9600 13.1222 0.9602 1.2958 0.5487 0.6612 0.3473 2.2144 1.3009 0.5987 3.8161 0.0045 0.0355 0.2069 1.9553 10.3598 42.9102 7.3809 10.5483 21.7559 1.6831 11.9140 5.8022 11.5506 0.9246 5.8565 0.2448 3.9084 6.5024 3.0464 8.1948 6.8795 2.3600 0.6945 9.7767 12.3265 3.7478 4.0924 10.6216 2.1890 0.9482 4.6592 2.5831 5.0998 0.0761 0.5419 3.2489 1.2532 9.7176 0.2275 11.0287 18.9012 35.6442 5.1339 13.1135 10.9110 10.4488 11.6354 2.1584 0.0245 0.0707 0.2975 54.1271 67.2125 272.7111 32.9806 17.5429 34.5088 34.5744 35.3447 37.0462 41.0255 8.8604 27.8597 51.8617 1.8982 5.5829 3.2179 3.9426 20.7419 46.5469 65.8384 15.8716
temp: 298.150 k
press: 1.00000 atm
elementType: 7 6 6 6 6 6 6 6 6 6 6 6 6 6 6 6 6 6 6 6 1 1 1 1 1 1 1 1 1 1 1 1 1 1 1 1 1 1 1 1 1
symmnumber: 1
zpe: 913368.1 jmol-1
zpe.correction: 0.347884 hartree
zpe.thermalcorrener: 0.364696 hartree
zpe.thermalcorrenthalpy: 0.365640 hartree
zpe.thermalcorrgfe: 0.303322 hartree
zpe.sumelectzpe: -789.929157 hartree
zpe.sumelectthermal: -789.912344 hartree
zpe.sumelectthermalent: -789.911400 hartree
zpe.sumelectthermalfe: -789.973718 hartree
dipole: 1.2577 -0.6520 1.0698
dipole: 1.7753
quadrupole: -112.5603 -114.1623 -115.1108
quadrupole: -0.5203 -4.3599 3.5424
quadrupole: 1.3842 -0.2179 -1.1663 -0.5203 -4.3599 3.5424
hfenergy: -790.2770401 hartree
pointgroup: C01 [X(C19H21N1)]
dipole: 0.4716937 -0.3076257 0.413152 debye
polarizability: 222.0879913|19.3268189|206.3288767|-16.0608177|15.7386684|169.8777595 unknown
InChI: InChI=1S/C19H21N/c1-20(2)12-13-11-18-14-7-3-5-9-16(14)19(13)17-10-6-4-8-15(17)18/h3-10,13,18-19H,11-12H2,1-2H3
charge 0 multiplicity 1
41 atoms
N  3.009446 -1.699771 -0.177961
C  0.750133 -1.136855 0.823595
C  0.200293 -0.553583 -0.542258
C  -1.022253 0.622898 1.457933
C  0.046162 -0.395879 2.013398
C  0.419486 0.955097 -0.506877
C  -1.303899 -0.807827 -0.524372
C  -0.250736 1.597554 0.571184
C  -1.968513 -0.174313 0.562562
C  2.288237 -1.017481 0.922786
C  1.207655 1.706737 -1.399463
C  -2.031959 -1.593894 -1.437751
C  -0.138389 2.989493 0.750365
C  -3.357541 -0.325094 0.732463
C  1.317092 3.109201 -1.223961
C  -3.431681 -1.745014 -1.269447
C  0.645794 3.7481 -0.154982
C  -4.091561 -1.113249 -0.18969
C  2.943966 -3.172539 -0.092051
C  4.400112 -1.220262 -0.315234
H  0.462527 -2.204989 0.851513
H  0.718676 -1.035681 -1.386758
H  -1.549455 1.130092 2.284652
H  0.788079 0.16296 2.615173
H  -0.45289 -1.118123 2.683901
H  2.613417 -1.399565 1.927208
H  2.556218 0.055878 0.886687
H  1.731159 1.206528 -2.222572
H  -1.519647 -2.081472 -2.275659
H  -0.656347 3.484137 1.580842
H  -3.869254 0.165289 1.569354
H  1.92131 3.702148 -1.920126
H  -4.005872 -2.349956 -1.980489
H  0.731155 4.833398 -0.027906
H  -5.174415 -1.231105 -0.068062
H  1.895019 -3.514336 -0.11396
H  3.419636 -3.577801 0.838346
H  3.46112 -3.616584 -0.961412
H  4.401805 -0.125817 -0.463017
H  4.869323 -1.687567 -1.200181
H  5.042091 -1.450756 0.573626
