program: Gaussian 09
title: 000199334
version: EM64L-G09RevD.01
frameworkgroup: C1[X(C4H11NO3S2)]
method: RPBEPBE
basis: SDD
operation: Freq
keyword: #p
keyword: freq=noraman
keyword: PBEPBE/SDD
title: #p freq=noraman PBEPBE/SDD
converged: YES YES NO NO
title: Mulliken charges:
elementType: S S O O O N C C C C H H H H H H H H H H H
charge: 0.088462 0.969256 -0.558570 -0.496683 -0.504120 -0.572161 0.295011 -0.779227 -0.683832 -0.677744 0.325555 0.281249 0.226650 0.206002 0.240506 0.229659 0.240262 0.212561 0.291595 0.286657 0.378912
chargesum: 0.00000
title: Mulliken charges with hydrogens summed into heavy atoms:
elementType: S S O O O N C C C C
charge: 0.088462 0.969256 -0.179659 -0.496683 -0.504120 0.006091 0.295011 -0.172422 -0.010674 0.004739
polarizability: 2.34241831e+02 -9.18730771e+00 1.01120011e+02 -1.21270514e+01 3.62330712e+00 8.98793204e+01
1716.lowfreq: -16.5344 -10.8818 -0.0017 -0.0014 0.0017 7.0779 24.2985 38.4692 63.3257
frequency: 23.1637 37.8700 63.1528 125.2178 132.9375 158.1356 179.1070 196.4228 207.4272 244.5352 250.5894 282.5971 296.2158 309.5062 317.3923 345.8766 386.1532 402.7756 429.0075 448.8108 471.3722 531.1028 676.9899 728.9385 826.5391 840.0513 884.9808 929.3004 936.0293 968.9840 990.7215 1030.3979 1061.4193 1146.2795 1183.4618 1216.8085 1283.2810 1326.2708 1372.5225 1392.2310 1407.2943 1455.4408 1460.7238 1477.1910 1481.3789 1621.2615 2946.3298 2970.2258 2987.3730 3051.3134 3061.6087 3083.0656 3094.5224 3107.0436 3453.2935 3480.5839 3621.6587
redmass: 5.4505 5.3549 4.1038 4.2424 6.5414 2.9122 3.1855 1.9033 1.1242 5.6459 1.1343 7.2426 1.6098 5.1683 1.9285 1.8123 2.1360 13.2983 2.0120 1.7894 2.2729 15.2544 6.3042 3.9960 15.5369 1.6835 2.3068 9.6273 1.4953 1.3088 1.7079 1.3944 1.2024 1.1985 2.0381 1.8659 1.5884 2.2223 1.2355 1.1988 1.0793 1.0547 1.0507 1.0544 1.0579 1.1067 1.0613 1.0365 1.0373 1.1001 1.0993 1.0975 1.0988 1.1004 1.0660 1.0441 1.1012
irintensity: 0.2996 1.8771 2.5633 20.2689 17.3266 5.9334 10.7716 69.9661 14.0507 15.3505 1.4699 25.4012 20.3598 20.6128 11.9312 9.1623 21.4333 46.5353 55.2489 329.7703 164.0796 149.7861 4.6102 9.1003 76.9512 24.9927 16.4711 79.3483 0.7664 1.6913 0.9801 0.6360 56.5850 22.6901 55.9533 16.1038 10.5540 8.7694 31.8786 29.3893 12.0271 2.5083 3.9421 8.5396 18.1575 61.4447 12.9405 14.2881 15.0851 11.6473 35.4785 19.1859 23.6954 10.7395 63.6874 76.8939 5.0365
temp: 298.150 k
press: 1.00000 atm
elementType: 16 16 8 8 8 7 6 6 6 6 1 1 1 1 1 1 1 1 1 1 1
symmnumber: 1
zpe: 409092.3 jmol-1
zpe.correction: 0.155815 hartree
zpe.thermalcorrener: 0.170335 hartree
zpe.thermalcorrenthalpy: 0.171279 hartree
zpe.thermalcorrgfe: 0.113763 hartree
zpe.sumelectzpe: -1234.557231 hartree
zpe.sumelectthermal: -1234.542711 hartree
zpe.sumelectthermalent: -1234.541767 hartree
zpe.sumelectthermalfe: -1234.599283 hartree
dipole: 4.0728 -0.6130 -0.0448
dipole: 4.1189
quadrupole: -74.1254 -78.3617 -74.9914
quadrupole: 2.8130 -12.6712 -0.7822
quadrupole: 1.7008 -2.5355 0.8348 2.8130 -12.6712 -0.7822
hfenergy: -1234.7130458 hartree
pointgroup: C01 [X(C4H11N1O3S2)]
dipole: -1.6044106 0.0639416 0.2186122 debye
dipolederiv: 0.5874545 0.0162705 -0.183562 -0.0629842 -0.1339645 0.0862294 -0.0986312 0.0638981 -0.1788926 1.3485569 -0.1358409 0.0936692 -0.6264738 1.4512953 0.12679 0.1784803 0.1426533 1.1273806 -0.4647156 0.1364706 0.1908184 0.4756756 -0.9433328 -0.2345067 0.23206 -0.1851405 -0.5575216 -1.1557706 -0.0784771 0.0523209 0.0687866 -0.4769325 -0.0279835 -0.1416509 0.0140506 -0.396302 -0.5274067 0.0558768 -0.0015311 0.1613634 -0.4469192 0.0657554 -0.337878 0.0481654 -0.5774597 -1.4156828 -0.1208018 0.2472944 -0.4524956 -0.2855427 -0.0187351 0.4032579 -0.1193894 -0.4781171 0.9012771 0.033697 -0.1496091 0.5750571 0.2073876 -0.0464669 0.1242815 0.049841 0.2986013 -0.4063092 -0.0472352 0.0089581 -0.3701397 0.0490204 0.090324 -0.2418837 0.0334822 0.0038262 0.1544545 0.0115622 -0.0713274 -0.1540126 0.0638238 0.0581306 -0.1668146 0.0459522 -0.1085696 -0.0254208 -0.0038389 0.0335058 0.0711188 -0.1117782 -0.0557381 -0.0560439 0.0084206 0.0175533 0.1092653 0.0169617 -0.0450095 0.0845319 0.0847057 0.0305855 0.1123175 -0.0003237 0.0307621 -0.0459803 0.0652625 0.0572338 -0.0574506 -0.0848092 -0.049578 0.005683 -0.0582189 0.0622181 -0.0697179 0.0281012 0.1190517 0.0742689 0.0723707 -0.0181103 0.0466966 -0.0274913 0.0211327 0.0724552 0.019464 -0.0102795 0.0579313 -0.1709851 0.003678 0.0438798 -0.0527522 0.0566447 -0.0948576 -0.0625469 -0.0784415 -0.1065986 0.0542133 -0.0250234 0.0203099 -0.0047816 0.0959253 -0.0991767 -0.1175729 -0.0451575 -0.0615584 0.0301188 -0.0248499 -0.0171124 -0.0254198 0.0947133 0.061438 0.0566885 0.0885097 -0.0044274 0.0780104 0.0245236 0.0488553 -0.0315819 -0.0014432 0.0418378 0.0488116 -0.0825805 0.0418499 0.0330531 0.0263991 -0.0436086 0.0809589 -0.0950681 0.354897 0.1052398 -0.0975173 0.2547552 0.2104675 -0.0054504 -0.1119305 0.0569795 0.1112567 0.5052402 0.000159 -0.0182412 0.0001465 0.0441251 0.0109469 0.0687081 0.007616 0.1668875 0.1681619 -0.0282516 -0.1081053 0.0306559 0.2756722 -0.0169201 -0.0689761 -0.0469186 0.3064722 unknown
polarizability: 230.7191531|-21.3943764|93.8471081|-16.7276987|-2.5368753|100.6749016 unknown
InChI: InChI=1S/C4H10NS.HO3S/c1-4(2,5)3-6;1-4(2)3/h3,5H2,1-2H3;1H
charge 0 multiplicity 1
21 atoms
S  0.328797 0.85943 -1.218416
S  2.209699 -0.19986 0.000447
O  2.166024 -1.791794 -0.959886
O  3.691579 0.424505 -0.181551
O  1.675532 -0.50022 1.505989
N  -3.097886 0.437558 1.125894
C  -2.216251 0.171998 -0.017437
C  -0.838748 0.90432 0.244189
C  -2.889334 0.744513 -1.286038
C  -1.98887 -1.349989 -0.141906
H  -0.311118 0.392926 1.077161
H  -0.992155 1.964588 0.517222
H  -2.250602 0.559251 -2.170369
H  -3.047633 1.836892 -1.198984
H  -3.868123 0.260976 -1.445751
H  -2.94767 -1.855877 -0.34629
H  -1.282294 -1.574024 -0.958852
H  -1.56425 -1.765063 0.791904
H  -2.887787 -0.043923 2.003154
H  -3.462941 1.387193 1.227665
H  3.061233 -2.2310 -0.845247
