program: Gaussian 09
title: 000199353
version: EM64L-G09RevD.01
frameworkgroup: C1[X(C24H26ClNO)]
method: RPBEPBE
basis: SDD
operation: Freq
keyword: #p
keyword: freq=noraman
keyword: PBEPBE/SDD
title: #p freq=noraman PBEPBE/SDD
converged: YES YES NO NO
title: Mulliken charges:
elementType: Cl O N C C C C C C C C C C C C C C C C C C C C C C C C H H H H H H H H H H H H H H H H H H H H H H H H H H
charge: -0.065205 -0.471477 -0.084385 0.026182 -0.498846 -0.369053 0.403530 0.371544 -0.377574 -0.559728 -0.636486 -0.394704 -0.380682 -0.357574 -0.429669 0.503631 -0.207452 -0.218197 -0.229056 -0.242047 -0.116766 -0.240981 -0.415875 -0.409925 -0.227167 -0.228452 -0.244191 0.208382 0.228724 0.228064 0.209837 0.218967 0.203440 0.220159 0.209540 0.222579 0.225480 0.193281 0.348871 0.293209 0.243677 0.263205 0.253520 0.253027 0.253198 0.228694 0.226735 0.231012 0.232106 0.232424 0.222722 0.223129 0.226623
chargesum: 0.00000
title: Mulliken charges with hydrogens summed into heavy atoms:
elementType: Cl O N C C C C C C C C C C C C C C C C C C C C C C C C
charge: -0.065205 -0.122606 -0.084385 0.026182 -0.061740 0.068848 0.403530 0.371544 0.044833 -0.130029 0.004854 -0.101495 -0.137004 -0.094370 -0.176149 0.503631 0.045575 0.035001 -0.000362 -0.015312 -0.116766 -0.009969 -0.183769 -0.177500 -0.004445 -0.005323 -0.017568
polarizability: 3.09128901e+02 -1.13126102e+01 2.93387173e+02 7.10266031e+00 -3.11547262e+01 2.16185365e+02
1716.lowfreq: -3.3857 -0.0009 0.0007 0.0014 2.8759 6.7185 10.2814 14.8131 18.8328
frequency: 8.3479 14.4100 18.6310 27.8765 29.7957 36.0986 41.6435 59.9634 79.0248 85.8374 109.0201 123.9251 162.1357 175.1657 192.8085 211.6928 222.3264 245.7341 255.4397 272.7068 285.7260 290.9580 300.9669 332.4969 338.4131 352.0132 386.5329 401.2453 402.7064 405.9189 408.4978 424.1176 441.1081 481.2075 506.9638 514.9841 549.1360 583.2366 616.7841 617.7827 624.7964 629.4455 641.4244 704.0959 704.9393 715.5888 728.8521 757.8407 771.5107 788.0382 791.4148 801.8776 826.1685 837.3729 845.4815 853.5888 854.2663 877.5845 914.9681 922.4463 933.8036 954.2173 975.5784 979.7517 981.0992 989.8691 990.2951 992.7230 998.2207 999.0464 1007.5558 1011.6967 1026.1750 1027.9788 1039.8944 1047.4555 1054.6068 1071.5699 1075.8880 1085.6527 1098.7288 1108.1555 1112.4166 1129.1239 1151.6156 1171.1142 1173.4109 1174.5979 1183.7195 1185.7414 1191.1489 1197.5968 1216.0252 1224.6546 1241.2911 1284.0268 1289.8825 1292.9006 1301.0528 1310.3218 1318.9170 1325.9012 1333.6390 1365.3271 1370.4174 1375.2662 1381.9530 1383.0679 1388.9603 1432.6051 1435.9404 1439.8204 1455.3114 1467.8273 1471.3712 1474.7417 1480.3617 1481.2633 1483.1202 1483.5995 1487.0089 1585.7421 1590.6461 1592.5870 1598.2682 1611.1022 1614.1247 2856.5614 2867.5306 2881.9727 2984.4941 2996.8457 3023.4212 3024.0719 3040.3694 3059.6376 3063.4643 3078.9226 3113.1278 3113.2638 3125.0272 3129.9426 3130.8259 3133.5789 3141.7870 3146.8936 3154.6002 3158.5664 3160.7430 3166.6378 3168.4756 3182.1187 3566.1894
redmass: 6.0009 4.0058 4.8147 4.1189 4.4102 3.8244 4.3091 5.2619 3.9090 4.6153 4.1980 2.9845 2.6647 2.9034 4.2130 3.1092 2.1637 4.7053 2.2746 2.7741 2.3701 3.7106 2.1099 2.5863 4.0296 3.3451 3.0127 2.8013 2.8230 3.0874 4.0155 2.6575 3.5776 4.1158 3.6309 3.0691 3.8524 4.5694 6.2110 6.3622 7.1044 4.2309 5.1328 1.6879 1.7875 4.2418 3.9521 1.8730 2.1276 1.4382 1.3075 3.3287 1.5186 1.7333 2.1226 1.2701 1.2469 2.3899 1.7097 2.0544 1.8272 1.4339 1.3873 1.3866 1.3786 6.3064 5.9759 1.3258 1.3195 4.2732 1.9461 2.3707 2.2001 2.3335 3.1971 2.8252 1.9715 2.6208 2.1550 1.7342 1.8281 1.4029 1.4043 1.6709 1.9220 1.0739 1.0702 1.3565 1.1709 1.1134 1.1861 2.5510 2.3028 1.8040 1.7475 1.3101 1.2965 1.4434 1.4336 1.2977 1.3566 1.2654 1.6699 1.3172 3.2563 2.1119 6.9857 4.2507 3.5228 1.1596 2.2315 2.1636 1.0991 1.0618 1.0955 2.3631 1.2013 1.5231 1.3279 2.0220 1.0795 7.8724 6.1383 6.0474 6.2380 6.0606 6.1854 1.0602 1.0679 1.0693 1.0587 1.0603 1.0808 1.0798 1.0957 1.0989 1.0974 1.1005 1.0863 1.0877 1.0846 1.0907 1.0894 1.0879 1.0958 1.0922 1.0954 1.0896 1.1015 1.1011 1.0953 1.0955 1.0659
irintensity: 0.2030 0.0112 0.0317 0.0589 0.2104 0.1205 0.0195 0.2115 0.2389 0.6111 0.5554 0.6912 2.4116 0.7049 0.8070 1.9017 2.1703 0.2162 3.3432 6.6908 55.1056 6.1447 82.2124 0.4835 31.1290 36.2370 9.3651 1.0925 0.0587 2.9267 5.2605 3.4308 4.0100 26.1818 6.7635 19.1216 9.7656 1.8624 2.1835 0.0613 0.7534 42.1123 3.1610 50.9488 57.0536 5.2901 25.2636 48.1945 42.8619 3.2294 1.4769 3.1269 37.7912 12.0611 23.8887 0.6913 0.0558 53.4770 10.3621 5.1696 9.0322 0.8023 0.0617 0.2452 1.2922 0.1138 1.3364 0.2858 0.4768 48.3803 9.7113 11.5700 4.7994 7.2527 18.8381 47.9336 12.0045 34.2585 21.9253 12.8776 1.3000 10.0330 19.0988 54.6552 28.8398 0.8671 1.0334 10.4591 3.0924 0.1060 11.9622 17.2157 0.2769 1.9877 12.7518 0.0925 0.2139 7.8501 17.5510 12.0323 4.5932 0.0676 36.9461 17.4376 9.5105 7.3633 1.1968 2.5800 11.1804 3.8125 12.3638 7.1283 2.6541 12.8646 2.5340 75.6754 6.0925 16.3401 10.8487 22.5260 15.8933 2.1327 1.9013 1.4287 6.5197 3.8417 11.8731 70.0838 72.0492 119.9522 21.6996 29.2688 25.2579 37.4843 8.6025 30.8879 26.1284 57.2965 13.1138 5.5857 1.1299 11.6199 8.0699 4.1930 46.0957 21.2538 29.9253 2.0717 26.5604 18.9546 3.5459 1.5443 7.6400
temp: 298.150 k
press: 1.00000 atm
elementType: 17 8 7 6 6 6 6 6 6 6 6 6 6 6 6 6 6 6 6 6 6 6 6 6 6 6 6 1 1 1 1 1 1 1 1 1 1 1 1 1 1 1 1 1 1 1 1 1 1 1 1 1 1
symmnumber: 1
zpe: 1141139.6 jmol-1
zpe.correction: 0.434637 hartree
zpe.thermalcorrener: 0.460565 hartree
zpe.thermalcorrenthalpy: 0.461510 hartree
zpe.thermalcorrgfe: 0.373000 hartree
zpe.sumelectzpe: -1518.210380 hartree
zpe.sumelectthermal: -1518.184452 hartree
zpe.sumelectthermalent: -1518.183508 hartree
zpe.sumelectthermalfe: -1518.272018 hartree
dipole: -0.0898 -2.9720 0.8698
dipole: 3.0979
quadrupole: -164.6608 -169.8916 -160.2247
quadrupole: -14.9909 -0.8136 -6.0406
quadrupole: 0.2649 -4.9659 4.7010 -14.9909 -0.8136 -6.0406
hfenergy: -1518.6450175 hartree
pointgroup: C01[X(C24H26Cl1N1O1)]
dipole: -0.1664626 1.2004105 0.1297622 debye
polarizability: 312.4094231|-9.9874811|298.0303126|-11.2066|14.5872451|208.2617043 unknown
InChI: InChI=1S/C24H26ClNO/c1-26(18-16-20-8-4-2-5-9-20)19-17-24(27,21-10-6-3-7-11-21)22-12-14-23(25)15-13-22/h2-15,27H,16-19H2,1H3
charge 0 multiplicity 1
53 atoms
Cl -3.057205 -5.475329 1.312592
O  -1.170296 0.289614 -1.673483
N  1.498366 1.026181 1.542515
C  -1.840953 0.357118 -0.342738
C  -0.857347 0.997307 0.678636
C  0.489997 0.252239 0.773585
C  -2.148063 -1.101826 0.040983
C  -3.149867 1.16205 -0.507084
C  2.893855 0.658806 1.193129
C  3.349378 1.271712 -0.160635
C  1.252082 0.979109 3.000167
C  -1.660931 -2.186592 -0.725355
C  -2.923612 -1.371114 1.196546
C  -4.06805 0.738139 -1.506021
C  -3.469983 2.304393 0.267169
C  4.796093 0.923382 -0.475082
C  -1.935059 -3.521087 -0.346202
C  -3.202515 -2.696519 1.593019
C  -5.271681 1.43711 -1.725912
C  -4.679554 3.006307 0.049157
C  -2.699035 -3.754681 0.811363
C  -5.583825 2.577077 -0.946188
C  5.853372 1.783244 -0.079248
C  5.126229 -0.292208 -1.129441
C  7.201685 1.441394 -0.329975
C  6.472435 -0.639436 -1.382929
C  7.516434 0.226906 -0.982828
H  -1.344643 1.030671 1.671634
H  -0.643673 2.042123 0.379629
H  0.865406 0.102936 -0.253598
H  0.335685 -0.763638 1.213519
H  3.55965 1.046351 1.987321
H  3.045477 -0.449708 1.163875
H  3.21012 2.366223 -0.094741
H  2.688308 0.906012 -0.969045
H  0.247994 1.376897 3.230094
H  1.989573 1.61357 3.522666
H  1.315211 -0.054144 3.426501
H  -1.119656 1.213315 -2.028369
H  -1.074437 -1.979817 -1.623772
H  -3.333651 -0.543359 1.786944
H  -3.825439 -0.145131 -2.106867
H  -2.784249 2.661258 1.042094
H  -1.559795 -4.358893 -0.941302
H  -3.803981 -2.901164 2.483419
H  -5.967869 1.095129 -2.499958
H  -4.912076 3.887794 0.657396
H  -6.520046 3.121347 -1.113003
H  5.615711 2.730136 0.422238
H  4.321033 -0.965935 -1.449525
H  8.004215 2.121366 -0.021466
H  6.707335 -1.580406 -1.893755
H  8.560952 -0.038928 -1.180968
