program: Gaussian 09
title: 000199366
version: EM64L-G09RevD.01
frameworkgroup: C1[X(C21H27NO2)]
method: RPBEPBE
basis: SDD
operation: Freq
keyword: #p
keyword: freq=noraman
keyword: PBEPBE/SDD
title: #p freq=noraman PBEPBE/SDD
converged: YES YES NO NO
title: Mulliken charges:
elementType: O O N C C C C C C C C C C C C C C C C C C C C C H H H H H H H H H H H H H H H H H H H H H H H H H H H
charge: -0.315334 -0.251409 -0.092014 0.139506 -0.113558 -0.397286 0.278039 0.395276 -0.773887 -0.356413 -0.380956 -0.379728 -0.360714 -0.633491 -0.623001 0.303494 -0.258569 -0.261809 -0.243548 -0.251831 -0.490401 -0.245590 -0.245926 -0.664171 0.257342 0.199448 0.221337 0.256174 0.226903 0.232667 0.261335 0.249789 0.260553 0.261428 0.219408 0.248581 0.180293 0.219441 0.184326 0.228495 0.228242 0.226785 0.224837 0.226486 0.235279 0.242958 0.228406 0.228648 0.240242 0.214795 0.219124
chargesum: 0.00000
title: Mulliken charges with hydrogens summed into heavy atoms:
elementType: O O N C C C C C C C C C C C C C C C C C C C C C
charge: -0.315334 -0.251409 -0.092014 0.139506 0.143785 0.023499 0.278039 0.395276 -0.058143 -0.095079 -0.131167 -0.119175 -0.099285 0.014791 0.009261 0.303494 -0.030328 -0.035024 -0.018711 -0.025345 -0.012164 -0.017184 -0.017278 0.009991
polarizability: 2.41255421e+02 9.87201010e-01 2.45445753e+02 -1.29686303e+01 2.44342578e+01 2.11691481e+02
1716.lowfreq: -8.8942 -0.0009 -0.0005 0.0006 1.5270 6.1798 21.6539 30.3917 44.7417
frequency: 21.5660 30.1328 44.7016 52.2846 56.2504 59.7142 60.1044 80.3601 83.9209 87.4588 108.7922 154.3155 185.1111 195.4706 205.7743 221.6149 226.9754 232.2615 237.2480 255.4997 263.2313 265.0570 285.8470 309.2086 313.7082 322.0647 352.3749 402.4670 403.7877 409.6310 427.8438 459.4004 477.8312 511.5985 544.9792 588.7080 606.9109 616.4781 617.7189 632.1076 663.2677 694.9205 706.0431 709.8650 760.6877 773.8770 791.5854 810.4907 824.8447 855.4381 861.4680 871.3505 877.8083 908.8710 921.7280 930.0111 940.9530 973.0898 983.0834 985.8999 991.0955 992.9695 997.6250 998.8940 1012.8797 1029.0539 1030.2493 1036.6957 1037.0512 1070.2396 1073.7330 1080.7533 1084.2403 1087.5361 1092.5376 1099.0691 1127.2588 1129.2537 1143.3312 1172.4162 1173.7049 1185.5716 1193.0925 1197.8581 1199.4648 1217.3130 1243.1060 1263.2823 1293.5980 1315.6589 1320.5991 1326.6050 1331.4364 1340.1809 1367.3536 1376.6173 1380.2957 1384.8887 1395.4905 1422.0112 1431.9759 1436.9399 1443.6693 1444.1716 1462.4182 1467.4127 1470.5776 1474.6021 1477.2891 1480.3300 1481.9942 1483.1493 1485.0223 1485.7518 1489.9858 1586.8662 1591.7135 1610.9890 1612.3201 1632.9256 2838.6930 2850.3941 2884.3884 2986.3479 2990.6211 2996.4461 3015.5540 3022.9269 3028.0306 3048.0008 3051.3219 3075.9699 3083.9801 3089.6296 3090.4069 3091.1668 3104.6197 3122.9391 3123.5179 3132.6011 3133.5445 3146.5999 3147.1495 3159.2767 3159.9772 3174.7064 3175.3316
redmass: 2.6187 3.6011 2.5035 3.3394 3.2165 3.5094 4.1167 7.0612 3.6201 3.7106 3.3644 3.6888 1.2695 1.8141 4.2749 2.7483 2.9160 1.2348 1.3472 1.6354 3.0509 4.0937 3.2601 4.0499 4.9871 3.2344 3.5918 2.1061 2.5895 2.8072 2.3308 2.7486 3.5925 3.1393 3.0790 4.5377 4.9758 6.3191 6.3647 4.7349 4.6630 4.8660 1.6579 1.6931 2.2257 1.9537 1.3647 4.4272 3.7775 1.2550 1.2631 3.9198 3.0365 3.1688 1.4082 1.4604 1.5513 2.2911 1.4103 1.3966 6.0916 4.4681 1.3202 1.4090 1.8946 2.2994 2.2505 1.7941 1.7842 2.0649 2.1181 1.9542 1.6620 1.4210 1.5005 2.0654 2.3235 2.8922 1.6250 1.0587 1.0544 2.3575 1.2650 2.6244 1.1565 2.5499 1.1859 2.5618 1.4512 1.4818 1.4022 1.3738 1.7407 1.2674 1.4692 4.3833 4.1379 1.3851 1.2097 1.1412 2.2166 2.2356 1.0878 1.1539 1.0488 1.0724 1.0414 1.0593 1.0555 1.2626 1.7064 1.0627 1.2959 1.4819 1.0614 6.0141 6.0687 5.9633 6.0420 9.4743 1.0579 1.0582 1.0678 1.0352 1.0625 1.0374 1.0717 1.0850 1.0748 1.0852 1.0958 1.1007 1.0982 1.0996 1.1001 1.1004 1.1000 1.0847 1.0847 1.0888 1.0884 1.0937 1.0936 1.0980 1.0982 1.0966 1.0960
irintensity: 0.0173 0.0437 0.7894 0.2886 0.0788 1.8073 0.1681 3.4114 0.6003 0.7016 0.1985 0.8690 0.0785 1.2226 0.4686 0.7962 0.1469 1.5740 0.0694 1.2169 0.6678 2.7205 3.1114 10.6600 3.0140 7.4602 3.3122 0.3540 0.2333 0.3169 1.0641 1.5601 3.8763 0.4094 7.8530 5.7405 1.7354 0.4879 0.0966 19.9441 5.9824 7.5504 41.4838 68.7340 75.1321 43.1929 16.1069 5.7482 1.0132 1.3228 1.1862 40.1953 37.3391 16.8900 7.2500 11.2749 5.5848 36.0244 2.3927 0.6706 0.9331 1.9161 0.2911 1.3466 46.7247 8.9165 9.2685 41.0504 13.6837 50.7479 42.3383 5.1262 8.2232 0.7459 7.8659 26.4790 10.9640 272.8244 15.6715 0.2666 0.2609 1.8144 0.8277 7.5385 2.5883 26.0712 4.6390 6.5706 21.0468 3.6687 10.6577 9.6266 39.1700 2.3806 8.4715 5.1750 6.1117 18.2735 20.9205 3.0317 13.3569 9.7964 27.3727 1.7146 12.8522 8.4969 9.2757 2.8190 28.0116 36.8499 10.6179 9.7188 11.1437 5.3578 10.3405 2.3111 0.1193 3.4711 4.4128 127.1494 65.3897 170.2633 97.2750 23.0856 17.6684 26.8177 44.4368 25.3695 32.3199 6.4412 5.2735 30.5450 36.9092 33.4459 36.2570 22.0574 24.7164 0.6389 0.4794 8.0721 6.3880 38.0424 22.7432 32.5487 28.6334 10.4420 5.3913
temp: 298.150 k
press: 1.00000 atm
elementType: 8 8 7 6 6 6 6 6 6 6 6 6 6 6 6 6 6 6 6 6 6 6 6 6 1 1 1 1 1 1 1 1 1 1 1 1 1 1 1 1 1 1 1 1 1 1 1 1 1 1 1
symmnumber: 1
zpe: 1125955.4 jmol-1
zpe.correction: 0.428854 hartree
zpe.thermalcorrener: 0.453640 hartree
zpe.thermalcorrenthalpy: 0.454584 hartree
zpe.thermalcorrgfe: 0.373212 hartree
zpe.sumelectzpe: -1019.822863 hartree
zpe.sumelectthermal: -1019.798076 hartree
zpe.sumelectthermalent: -1019.797132 hartree
zpe.sumelectthermalfe: -1019.878505 hartree
dipole: 0.1767 0.8936 1.5515
dipole: 1.7991
quadrupole: -134.2615 -141.1124 -138.2958
quadrupole: -1.3847 -4.5343 0.3392
quadrupole: 3.6284 -3.2225 -0.4059 -1.3847 -4.5343 0.3392
hfenergy: -1020.2517163 hartree
pointgroup: C01 [X(C21H27N1O2)]
dipole: 0.113936 0.3728094 0.5907888 debye
polarizability: 240.5635061|1.5945462|247.4642837|-12.4441091|23.6211678|210.364864 unknown
InChI: InChI=1S/C21H27NO2/c1-5-20(23)24-21(17(2)16-22(3)4,18-12-8-6-9-13-18)19-14-10-7-11-15-19/h6-15,17H,5,16H2,1-4H3
charge 0 multiplicity 1
51 atoms
O  -0.282521 -0.603622 1.201199
O  -1.023204 -2.601518 0.206295
N  -3.507242 0.500576 -1.278751
C  0.181006 0.070427 -0.105923
C  -1.026272 0.142054 -1.112286
C  -2.292198 0.777136 -0.470322
C  0.592246 1.480778 0.361407
C  1.385932 -0.759933 -0.596839
C  -0.68801 0.898876 -2.417991
C  1.490108 2.250677 -0.423483
C  1.310489 -1.665235 -1.684134
C  0.046728 2.065221 1.531916
C  2.604439 -0.681216 0.1297
C  -4.04488 -0.858522 -1.05717
C  -4.551093 1.530378 -1.106135
C  -0.77453 -1.90898 1.219386
C  1.827833 3.570157 -0.053115
C  2.427583 -2.446771 -2.052599
C  0.390296 3.383411 1.907933
C  3.718733 -1.467602 -0.22914
C  -0.943945 -2.366031 2.66425
C  1.279113 4.144952 1.116241
C  3.637555 -2.351752 -1.329891
C  -1.87649 -3.584035 2.797701
H  -1.275127 -0.901697 -1.369206
H  -2.418784 0.420212 0.581031
H  -2.154159 1.873444 -0.421945
H  -1.584376 0.872247 -3.061809
H  0.156648 0.446628 -2.965951
H  -0.442824 1.957236 -2.218865
H  1.937652 1.812126 -1.321632
H  0.378151 -1.784825 -2.241593
H  -0.628616 1.476633 2.157809
H  2.676031 0.001534 0.983423
H  -4.867319 -1.053344 -1.768838
H  -3.262752 -1.618118 -1.221538
H  -4.442004 -1.002533 -0.018477
H  -5.393134 1.321914 -1.791386
H  -4.963758 1.579699 -0.065325
H  -4.142393 2.524506 -1.359642
H  2.52374 4.144729 -0.674716
H  2.346688 -3.13864 -2.898377
H  -0.036337 3.813252 2.821461
H  4.647648 -1.389927 0.346975
H  -1.294615 -1.509644 3.26815
H  0.068695 -2.60978 3.044369
H  1.544583 5.167295 1.408042
H  4.502296 -2.961295 -1.61558
H  -1.53187 -4.409942 2.15315
H  -1.901019 -3.937153 3.843723
H  -2.90742 -3.332384 2.4922
