program: Gaussian 09
title: 000199344
version: EM64L-G09RevD.01
frameworkgroup: C1[X(C15H26O4)]
method: RPBEPBE
basis: SDD
operation: Freq
keyword: #pfreq=noraman
keyword: PBEPBE/SDD
title: #p freq=noraman PBEPBE/SDD
converged: YES YES NO NO
title: Mulliken charges:
elementType: O O O O C C C C C C C C C C C C C C C H H H H H H H H H H H H H H H H H H H H H H H H H H
charge: -0.258664 -0.258568 -0.256144 -0.256962 -0.217467 -0.235167 -0.485347 -0.480945 -0.436304 0.234360 0.249170 -0.306065 -0.305181 -0.359104 -0.355851 -0.348352 -0.349568 -0.689151 -0.689062 0.254549 0.261532 0.220284 0.272795 0.261860 0.217179 0.206459 0.246299 0.224220 0.218749 0.218465 0.225616 0.258546 0.196441 0.197855 0.257034 0.199342 0.189322 0.199855 0.189256 0.218706 0.213422 0.211013 0.220995 0.214016 0.210562
chargesum: 0.00000
title: Mulliken charges with hydrogens summed into heavy atoms:
elementType: O O O O C C C C C C C C C C C C C C C
charge: -0.258664 -0.258568 -0.256144 -0.256962 0.037082 0.026365 0.007732 -0.001905 0.016454 0.234360 0.249170 0.136903 0.138900 0.095883 0.099038 0.040313 0.039543 -0.046010 -0.043489
polarizability: 1.83771805e+02 -6.20561999e+00 1.81410277e+02 2.36716175e+00 2.70244580e+00 1.45281905e+02
1716.lowfreq: -12.8460 -7.7400 -6.0595 0.0006 0.0009 0.0010 14.3340 20.1426 33.4082
frequency: 12.3556 19.3974 33.3528 39.0355 49.5779 51.3691 55.4196 67.5300 78.8845 106.5205 114.2444 115.2981 159.9619 187.1542 206.9172 215.7434 228.9195 234.6450 265.5518 284.9205 297.5149 329.8537 344.8405 355.7373 403.2250 408.2113 474.0717 501.3671 564.3987 579.5858 598.2887 650.8765 710.8165 738.1215 741.6642 749.7527 773.5291 804.2383 813.4330 819.6340 823.4531 872.9653 889.1823 900.1054 902.8228 911.1550 938.7710 940.5868 957.5667 964.7474 991.3601 1001.7127 1030.9583 1031.0061 1074.9686 1075.7642 1077.6934 1089.9128 1107.4525 1114.4668 1124.9074 1140.4188 1148.9600 1163.7762 1164.1676 1176.2688 1184.1438 1205.5429 1225.8163 1226.9216 1252.4567 1272.8598 1276.2020 1284.4030 1286.8415 1287.3620 1295.8899 1297.3810 1297.8076 1310.9135 1324.6316 1335.3018 1343.9158 1346.8951 1370.3580 1371.0781 1391.1517 1391.5738 1454.2524 1454.6848 1463.2307 1470.3056 1471.8248 1472.6509 1475.5584 1476.1884 1478.5364 1479.4404 1481.8499 1489.3851 1490.4706 1615.2807 1626.4901 2964.5070 2965.6374 2976.0234 2976.2121 2992.3235 2992.6768 2996.0009 3009.3496 3010.3954 3011.4538 3017.5775 3019.3746 3020.3472 3022.8240 3039.8105 3053.6664 3055.7589 3072.9768 3073.3944 3075.6887 3076.7404 3078.1029 3099.2508 3099.5038 3100.5543 3103.5915
redmass: 3.5826 3.4981 3.7050 3.0566 3.2796 2.7401 3.9682 1.7586 3.2859 4.1983 2.9683 2.6695 3.7012 2.9716 3.1779 2.0544 1.1759 1.3154 3.8611 3.7445 3.3763 3.5342 2.5810 3.2018 2.9583 2.9436 5.2837 5.0403 5.1440 3.1654 4.8066 3.4401 4.0794 1.1540 1.2336 2.0150 2.1511 1.6947 1.5055 1.6862 2.6094 5.0863 3.6671 1.8023 1.9351 2.2278 1.2744 1.2765 2.6849 2.8159 2.1445 1.7206 3.7516 3.7767 2.4373 2.4548 1.5270 2.7126 2.6902 2.4235 2.8528 2.0934 1.8681 1.7506 1.7626 1.6180 1.3273 1.2897 1.3140 1.3088 1.3466 1.2338 1.2375 1.1514 1.3829 1.1624 1.1161 1.3352 1.1618 1.6122 1.5090 1.4215 1.4333 1.3971 1.4103 1.4247 1.2148 1.2162 1.1020 1.0975 1.0841 1.0687 1.0782 1.0642 1.0457 1.0426 1.0657 1.0658 1.0930 1.0854 1.0879 9.5716 9.1027 1.0586 1.0589 1.0361 1.0362 1.0617 1.0631 1.0766 1.0673 1.0982 1.0990 1.0633 1.0578 1.0577 1.0723 1.0815 1.1028 1.1018 1.1002 1.1003 1.1005 1.1003 1.1008 1.1003 1.1072 1.1081 1.1012
irintensity: 0.0428 0.3721 0.6061 1.2531 1.6599 0.0919 1.2038 0.3036 0.6337 0.3473 0.4865 0.4452 0.9416 1.3166 0.6927 3.7020 0.1580 0.7691 7.4271 1.0464 4.7735 12.5057 14.1785 8.4524 1.5601 6.8386 2.6899 3.2571 5.3895 1.6907 3.1160 2.4883 7.8243 7.8284 13.1695 1.0347 4.1840 0.7569 5.0712 5.0247 9.5094 16.8571 17.3117 6.8943 1.2926 8.8437 3.4318 6.4130 18.9351 14.1477 30.5416 14.8706 8.9950 14.8099 4.0666 4.1997 23.9468 79.5704 215.3033 18.7733 159.7510 53.7997 86.8469 2.2780 6.6979 62.6221 3.5867 14.3407 4.3017 2.9980 6.3794 3.6158 5.4224 0.6111 11.3665 1.6665 1.6199 15.4220 7.6927 18.7165 13.5234 10.8872 8.4527 3.4559 2.6049 2.7982 12.3509 6.7219 10.0861 8.1444 12.7926 2.3181 20.5661 2.2659 13.0889 8.5086 4.3957 1.6258 13.1750 23.1889 19.5152 225.0804 105.5979 36.6374 38.6198 32.6067 29.8031 14.0166 12.3527 19.5050 16.8010 21.4507 13.9150 43.4981 62.3336 41.9207 38.5254 24.3402 3.9298 2.2959 47.1486 70.3644 61.4363 49.0539 17.6339 2.5600 51.4600 33.8120 12.2768
temp: 298.150 k
press: 1.00000 atm
elementType: 8 8 8 8 6 6 6 6 6 6 6 6 6 6 6 6 6 6 6 1 1 1 1 1 1 1 1 1 1 1 1 1 1 1 1 1 1 1 1 1 1 1 1 1 1
symmnumber: 1
zpe: 1020919.7 jmol-1
zpe.correction: 0.388848 hartree
zpe.thermalcorrener: 0.410885 hartree
zpe.thermalcorrenthalpy: 0.411829 hartree
zpe.thermalcorrgfe: 0.333425 hartree
zpe.sumelectzpe: -886.581743 hartree
zpe.sumelectthermal: -886.559706 hartree
zpe.sumelectthermalent: -886.558762 hartree
zpe.sumelectthermalfe: -886.637165 hartree
dipole: 0.5818 -0.3464 -0.3766
dipole: 0.7748
quadrupole: -108.2232 -106.2394 -119.1958
quadrupole: -1.5445 -2.4032 -0.6057
quadrupole: 2.9962 4.9801 -7.9763 -1.5445 -2.4032 -0.6057
hfenergy: -886.9705907 hartree
pointgroup: C01 [X(C15H26O4)]
dipole: 0.0447979 -0.2680146 0.1381415 debye
polarizability: 176.6469354|-5.3011303|186.6131327|7.4837502|3.5789527|147.2039193 unknown
InChI: InChI=1S/C15H26O4/c1-3-5-9-18-14(16)12-7-8-13(11-12)15(17)19-10-6-4-2/h12-13H,3-11H2,1-2H3
charge 0 multiplicity 1
45 atoms
O  2.450356 1.142629 -0.423959
O  -1.579099 -2.142276 0.723966
O  0.592065 0.318214 -1.564289
O  -0.460863 -0.257707 1.509245
C  2.238578 -1.245844 -0.538686
C  0.801742 -2.355859 1.126816
C  2.091292 -1.508104 1.003899
C  1.48612 -2.423087 -1.238374
C  0.88952 -3.305109 -0.100775
C  1.646889 0.115172 -0.916198
C  -0.441106 -1.457096 1.139628
C  1.913475 2.533683 -0.555954
C  -2.839303 -1.339804 0.613573
C  1.036753 2.883253 0.654113
C  -2.940989 -0.697928 -0.776483
C  0.441033 4.305853 0.533075
C  -4.231806 0.142965 -0.920356
C  -0.425546 4.68093 1.754891
C  -4.363174 0.77163 -2.324517
H  3.310493 -1.209605 -0.802153
H  0.780583 -2.930834 2.073609
H  2.952056 -2.106156 1.3535
H  2.054899 -0.576416 1.589578
H  0.679955 -2.007503 -1.867971
H  2.159069 -3.002661 -1.893335
H  1.577693 -4.134975 0.147903
H  -0.086681 -3.739503 -0.366259
H  1.340778 2.602754 -1.498718
H  2.817219 3.163383 -0.610481
H  -3.639058 -2.078339 0.790107
H  -2.841088 -0.573469 1.409902
H  0.224497 2.138291 0.744668
H  1.643161 2.809617 1.577981
H  -2.926544 -1.492508 -1.547873
H  -2.054153 -0.060591 -0.952519
H  -0.173272 4.369944 -0.388109
H  1.258776 5.046971 0.418018
H  -4.235147 0.945167 -0.154701
H  -5.117992 -0.492307 -0.714713
H  -1.263154 3.969209 1.875775
H  -0.851633 5.695797 1.651633
H  0.170636 4.65596 2.686266
H  -3.501065 1.428399 -2.543401
H  -5.284479 1.376274 -2.411492
H  -4.394688 -0.009912 -3.106728
