program: Gaussian 09
title: 000199325
version: EM64L-G09RevD.01
frameworkgroup: C1[X(C18H23N3)]
method: RPBEPBE
basis: SDD
operation: Freq
keyword: #pfreq=noraman
keyword: PBEPBE/SDD
title: #p freq=noraman PBEPBE/SDD
converged: YES YES NO NO
title: Mulliken charges:
elementType: N N N C C C C C C C C C C C C C C C C C C H H H H H H H H H H H H H H H H H H H H H H H
charge: -0.070770 -0.187845 -0.006094 -0.359187 -0.377296 -0.417971 -0.391939 -0.346191 0.284745 -0.571894 0.301904 -0.345793 0.508595 -0.373640 -0.832025 -0.254898 -0.253359 -0.354036 -0.353533 -0.333222 -0.332275 0.200714 0.189690 0.187471 0.210242 0.227916 0.194436 0.214596 0.222458 0.195464 0.223721 0.218649 0.228533 0.241176 0.226090 0.227413 0.221226 0.245273 0.221415 0.224454 0.233956 0.236058 0.237872 0.237898
chargesum: 0.00000
title: Mulliken charges with hydrogens summed into heavy atoms:
elementType: N N N C C C C C C C C C C C C C C C C C C
charge: -0.070770 -0.187845 -0.006094 0.031218 0.020417 0.004381 0.045115 0.072994 0.284745 -0.124711 0.301904 -0.104617 0.508595 -0.147550 -0.138113 -0.033482 -0.028905 -0.120081 -0.117474 -0.095349 -0.094378
polarizability: 3.10719277e+02 -1.57713616e+01 1.76035774e+02 6.78165596e-01 8.22430125e-01 1.58484833e+02
1716.lowfreq: -9.4298 -0.0007 -0.0005 -0.0002 0.9120 3.6226 14.0544 19.4723 26.7911
frequency: 13.1533 19.3532 26.7290 55.1065 68.0955 79.8313 96.5877 124.2490 183.0691 186.3778 199.1771 222.9649 265.2265 282.6532 298.2329 308.8392 324.7548 341.3905 368.9722 372.8724 397.7369 451.3790 464.5124 476.3426 509.5182 523.9344 549.1667 552.0757 596.1631 632.4516 663.7035 705.0599 723.8358 748.2398 760.7873 766.1578 790.7964 793.9810 807.9516 845.7167 851.3402 857.1369 887.5545 921.5650 931.3036 947.6999 960.8298 963.9738 974.1680 976.0417 980.9490 1004.7247 1014.4399 1035.8933 1042.7778 1049.6554 1055.0712 1057.6422 1062.2532 1085.0921 1097.6992 1116.2828 1129.2106 1145.3786 1163.2758 1173.7089 1195.6837 1202.3060 1213.0080 1217.2912 1227.4054 1232.6564 1257.7669 1283.2337 1288.2520 1290.4437 1303.6537 1310.5182 1333.9368 1336.1469 1343.3046 1345.0521 1363.1077 1368.2334 1379.8750 1389.9160 1391.1050 1404.2218 1433.1013 1452.0496 1457.3854 1460.0099 1464.0180 1466.2744 1467.9337 1472.3373 1485.4915 1488.9823 1492.4372 1556.7091 1581.7144 1589.1078 1609.5558 2847.5785 2853.2908 2866.7737 2893.8153 2910.1987 2963.1570 2999.9710 3018.6750 3029.5263 3039.6932 3042.4300 3052.6579 3066.4947 3080.2402 3090.6716 3113.9288 3122.2117 3123.4266 3125.9904 3143.5525 3146.5927 3150.4974 3161.4196
redmass: 3.8015 4.5924 4.5060 4.5182 3.0281 3.7331 4.2001 4.4982 3.6036 2.7532 1.0547 3.7775 2.1285 2.6512 3.9383 3.0444 2.6526 2.5262 2.5663 3.0623 2.1917 2.7797 3.3299 2.9707 4.5449 3.6122 4.6166 3.3187 5.0469 2.7189 6.9184 3.3077 2.3640 3.5887 1.5402 3.4408 1.2358 4.0435 1.7696 1.8756 1.8930 1.3917 1.2474 3.5272 1.4384 2.1589 5.7345 1.4385 1.3178 1.4913 1.5496 2.6623 1.7396 2.8745 1.5423 2.2273 2.0780 1.8989 2.1891 1.7275 1.8795 1.8018 2.5462 3.0339 2.0069 1.0821 1.1218 2.1988 1.8550 1.3798 1.9251 1.8161 1.3210 1.3396 1.4142 1.5123 1.4281 5.8381 1.2874 1.2977 1.5173 1.5504 1.7573 1.7448 2.1240 1.3399 1.3443 2.0228 2.0500 1.0830 1.1069 1.1368 1.1404 1.8967 1.0823 1.1080 1.0963 1.2070 2.0512 6.7594 6.4385 5.7433 6.0490 1.0704 1.0710 1.0693 1.0690 1.0715 1.0397 1.0610 1.0868 1.0889 1.0895 1.0928 1.0903 1.1029 1.0995 1.0889 1.0870 1.0867 1.0881 1.0879 1.0961 1.0927 1.0994 1.1002
irintensity: 0.3920 0.3405 0.8327 0.5737 0.2616 0.9876 0.0569 0.4564 2.9260 3.2070 0.5486 4.8809 4.7905 1.0151 1.1971 1.5596 3.5987 5.2368 0.0187 0.1927 0.4642 7.2073 4.8213 2.3317 5.9444 24.7612 0.7461 3.5994 7.8910 6.0749 0.4584 4.2394 15.6656 1.4071 67.5387 6.0180 2.2867 1.3155 29.5817 12.7859 8.5232 1.2334 0.0312 26.4954 2.0223 6.9978 2.4315 0.7437 0.5211 0.0304 5.4911 48.0447 3.9069 30.2556 7.7110 14.1446 5.3173 6.3634 5.4331 0.3093 6.7890 24.9883 77.3878 46.5386 7.7596 0.2855 4.0583 5.2950 15.1195 0.4426 36.9337 58.7072 22.4028 3.3855 4.2140 5.4534 27.8826 2.3365 11.0028 6.1344 7.0710 28.9830 3.2039 42.0789 13.3166 8.5977 9.0052 16.9579 21.6702 4.1256 20.8022 22.0653 4.7981 6.2766 22.2389 1.2272 12.0629 5.4198 103.2415 12.8756 8.3763 74.0467 44.7842 42.9847 52.5695 117.2109 73.1940 107.9103 37.4702 17.2313 12.6245 50.6683 51.9473 23.7223 25.8435 26.8326 22.1863 13.0228 12.5854 7.3198 13.4322 11.8078 57.4005 36.5688 0.6587 25.2800
temp: 298.150 k
press: 1.00000 atm
elementType: 7 7 7 6 6 6 6 6 6 6 6 6 6 6 6 6 6 6 6 6 6 1 1 1 1 1 1 1 1 1 1 1 1 1 1 1 1 1 1 1 1 1 1 1
symmnumber: 1
zpe: 981415.3 jmol-1
zpe.correction: 0.373801 hartree
zpe.thermalcorrener: 0.392961 hartree
zpe.thermalcorrenthalpy: 0.393905 hartree
zpe.thermalcorrgfe: 0.323422 hartree
zpe.sumelectzpe: -862.387672 hartree
zpe.sumelectthermal: -862.368512 hartree
zpe.sumelectthermalent: -862.367568 hartree
zpe.sumelectthermalfe: -862.438051 hartree
dipole: 2.0028 -0.1950 -0.3007
dipole: 2.0346
quadrupole: -162.1469 -120.6129 -123.1143
quadrupole: 5.0117 3.0563 -2.5046
quadrupole: -26.8555 14.6785 12.1770 5.0117 3.0563 -2.5046
hfenergy: -862.7614729 hartree
pointgroup: C01 [X(C18H23N3)]
dipole: 0.789823 0.1289018 0.0177976 debye
polarizability: 310.8489249|8.013658|166.8039753|-12.9812264|-8.6824578|167.5869837 unknown
InChI: InChI=1S/C18H23N3/c1-16-4-2-3-5-18(16)21-14-12-20(13-15-21)11-8-17-6-9-19-10-7-17/h2-7,9-10H,8,11-15H2,1H3
charge 0 multiplicity 1
44 atoms
N  -0.608025 0.277244 0.294784
N  2.256662 -0.017567 -0.045418
N  -7.14675 -0.44896 0.104067
C  0.002262 0.110275 -1.047794
C  0.221887 -0.403535 1.3220
C  1.438052 0.665153 -1.069338
C  1.65649 0.148119 1.303521
C  -2.024611 -0.149435 0.350403
C  3.683827 0.062933 -0.15669
C  -2.976887 0.836311 -0.38329
C  4.509293 -0.938814 0.456279
C  4.300905 1.094539 -0.920833
C  -4.427293 0.416407 -0.231281
C  5.91421 -0.836958 0.313016
C  3.913377 -2.132184 1.182764
C  5.702828 1.162616 -1.060993
C  6.521361 0.200735 -0.430221
C  -5.027479 -0.50825 -1.124237
C  -5.230946 0.892971 0.83591
C  -6.367974 -0.906395 -0.922279
C  -6.564109 0.441977 0.962374
H  -0.598619 0.661102 -1.793532
H  0.028177 -0.967978 -1.349971
H  0.259868 -1.510355 1.154677
H  -0.227964 -0.221352 2.315961
H  1.883873 0.485173 -2.063578
H  1.39182 1.767595 -0.898997
H  1.630656 1.227231 1.583823
H  2.267871 -0.379953 2.051108
H  -2.170712 -1.178888 -0.067485
H  -2.324413 -0.192763 1.414962
H  -2.71401 0.878235 -1.456586
H  -2.809794 1.8437 0.03898
H  3.680574 1.861576 -1.395764
H  6.542921 -1.609427 0.773982
H  4.58233 -3.006959 1.103304
H  3.761154 -1.941144 2.263818
H  2.931091 -2.396239 0.750911
H  6.151152 1.9697 -1.651862
H  7.611439 0.245039 -0.528132
H  -4.461897 -0.908488 -1.973748
H  -4.827519 1.613486 1.556813
H  -6.850191 -1.617324 -1.603344
H  -7.202789 0.803248 1.776818
