program: Gaussian 09
title: 000199382
version: EM64L-G09RevD.01
frameworkgroup: C1[X(C26H31NO)]
method: RPBEPBE
basis: SDD
operation: Freq
keyword: #p
keyword: freq=noraman
keyword: PBEPBE/SDD
title: #p freq=noraman PBEPBE/SDD
converged: YES YES NO NO
title: Mulliken charges:
elementType: O N C C C C C C C C C C C C C C C C C C C C C C C C C C H H H H H H H H H H H H H H H H H H H H H H H H H H H H H H H
charge: -0.464514 -0.099914 -0.100419 0.034103 -0.376946 -0.074570 -0.760049 0.328079 0.418210 -0.567005 -0.639146 -0.731432 -0.381785 -0.402959 -0.409792 -0.406895 0.506160 -0.247183 -0.258435 -0.247120 -0.234271 -0.435337 -0.400159 -0.239276 -0.246901 -0.230358 -0.235755 -0.245313 0.201630 0.218080 0.242703 0.219247 0.224721 0.221513 0.245372 0.208128 0.223751 0.216760 0.218295 0.191913 0.219766 0.220365 0.240435 0.344033 0.261588 0.241737 0.269514 0.221668 0.224773 0.227697 0.226478 0.224762 0.232801 0.232753 0.229499 0.229052 0.222324 0.221737 0.225887
chargesum: 0.00000
title: Mulliken charges with hydrogens summed into heavy atoms:
elementType: O N C C C C C C C C C C C C C C C C C C C C C C C C C C
charge: -0.120481 -0.099914 0.101211 0.034103 0.083837 0.144677 -0.068443 0.328079 0.418210 -0.135126 -0.012178 -0.050866 -0.120197 -0.161223 -0.140278 -0.185227 0.506160 -0.022410 -0.030738 -0.020642 -0.009508 -0.202536 -0.167406 -0.009777 -0.017850 -0.008034 -0.014018 -0.019426
polarizability: 3.34135601e+02 1.24244451e+00 2.74409134e+02 -1.47821601e+01 -1.45855259e+00 2.43184796e+02
1716.lowfreq: -7.3876 -5.1937 -0.0005 0.0002 0.0006 2.1784 11.3752 20.7895 21.8866
frequency: 10.3011 20.7512 21.6285 28.1977 45.7117 46.9415 55.9181 63.8749 75.8656 90.9634 99.1112 117.9616 164.1080 172.4445 198.6043 213.3670 228.9710 235.5194 237.6548 248.2728 262.7157 271.2576 281.7759 285.9523 302.7812 329.9118 354.5388 363.8925 370.7210 402.4521 403.3395 403.9374 414.5475 422.8674 443.8438 464.8668 504.5532 512.8244 532.5014 552.4078 593.6978 616.0489 617.2695 618.0507 629.6640 635.9692 698.0491 704.6877 705.3587 710.4143 749.2984 759.7255 767.7008 783.3901 823.4969 849.8877 851.2660 854.2984 857.8230 865.0992 884.2055 894.7977 903.7763 915.5820 920.1830 926.3765 941.3821 952.1448 974.4615 975.7386 980.6558 981.7550 988.9633 989.9413 991.5499 992.3746 995.3434 998.5960 1026.6508 1029.7146 1031.9284 1040.8348 1047.0201 1061.3258 1084.8608 1090.1277 1090.8595 1098.6516 1118.0668 1123.2149 1132.4403 1149.6118 1165.5705 1170.8212 1172.7477 1173.5334 1186.1854 1193.7981 1197.9961 1199.6623 1210.6777 1214.9681 1216.3782 1260.0381 1284.1007 1287.7647 1296.2386 1313.3801 1314.9948 1321.4768 1327.4484 1332.7403 1354.4910 1363.8033 1374.0950 1375.4763 1379.3794 1381.4394 1383.9499 1429.4143 1433.9619 1436.8591 1439.5976 1461.1936 1466.9823 1468.6951 1473.2895 1476.3030 1477.7246 1479.6583 1479.9352 1483.5891 1487.7324 1490.6103 1586.7431 1589.2585 1591.8685 1606.7402 1610.9642 1613.5161 2862.5628 2904.2310 2976.7989 2979.4639 2987.6722 2989.6137 2990.5412 3013.8603 3049.8483 3066.7166 3069.8373 3074.5794 3079.2902 3087.3544 3091.6010 3111.6221 3115.1322 3120.2217 3122.6050 3128.0511 3130.0175 3132.2026 3140.8652 3140.9619 3148.5414 3151.8516 3157.4879 3160.1714 3165.1888 3167.2647 3546.3803
redmass: 4.6916 4.3711 4.1015 3.9848 3.8452 3.6459 3.6443 4.4343 4.2994 3.5954 2.8065 4.3306 3.4479 1.9035 1.4002 1.2079 3.3744 3.6671 3.2308 1.8373 1.7917 3.1326 4.1296 3.5147 3.0102 3.7399 2.8134 2.4334 1.3534 2.8232 2.8178 2.6002 2.3850 2.4567 3.1984 3.4230 3.3164 3.3681 2.7572 3.5992 4.3999 6.2935 6.4039 6.3156 4.8849 4.3406 4.6667 1.7524 1.7579 1.7114 1.8815 1.8898 2.0625 3.4964 3.0303 1.6302 1.3454 1.6365 1.2812 2.2123 2.0987 1.5755 1.9103 1.5039 1.5920 1.5826 2.3182 2.3850 1.3945 1.4231 1.8722 1.6970 5.2444 5.9755 3.1809 1.3283 1.3433 1.3542 2.1872 2.3138 2.1904 1.6008 2.0885 2.1288 1.6179 1.6111 1.6122 1.7100 1.6804 2.1949 2.1469 2.2307 2.9806 1.0568 1.0549 1.0571 1.1148 1.3033 1.1506 2.2230 2.1336 1.8805 1.8328 1.6274 1.3883 1.5519 1.3908 1.3478 1.3393 1.3411 1.3942 1.2697 1.3228 1.2829 2.0307 3.3897 3.0035 3.1281 1.6401 2.2070 2.2348 1.1593 2.1543 1.0580 1.0724 1.0829 1.0741 1.0774 1.7215 2.1433 1.2531 1.9551 1.0803 1.0543 5.9580 6.0551 6.0296 6.0810 6.1126 6.1724 1.0563 1.0698 1.0810 1.0356 1.0381 1.0594 1.0803 1.0730 1.1024 1.0951 1.0946 1.0991 1.0992 1.0993 1.0997 1.0867 1.0866 1.0846 1.0846 1.0869 1.0910 1.0886 1.0926 1.0958 1.0927 1.0944 1.0948 1.1014 1.1007 1.0995 1.0658
irintensity: 0.0216 0.0416 0.0289 0.0459 0.2361 0.1584 0.1504 0.4881 0.0180 0.2219 0.2568 0.3679 0.5133 0.5772 0.4701 0.0811 0.3870 5.4526 0.5470 0.2217 9.2139 8.8344 2.9850 7.8412 1.6936 6.7253 5.4584 2.8076 109.3207 1.1413 0.0402 8.0945 17.5478 15.0056 1.4873 4.5990 3.9278 5.4298 15.8884 5.1246 4.6700 0.3698 0.2369 0.1751 30.4271 17.5646 1.6910 50.0165 65.6745 51.5966 29.3290 38.6455 41.3098 15.5164 5.3857 1.5558 1.4991 1.5907 0.9410 7.8289 5.7982 10.9978 11.0855 2.7490 6.6110 22.4525 29.6714 2.4179 0.5842 1.0694 29.7425 3.8640 2.1626 0.0252 0.8149 1.2632 1.3305 0.3401 9.2122 8.5026 8.0525 3.0306 60.5682 9.5938 6.0828 6.2617 10.9711 14.7269 52.6385 2.6796 51.1146 11.1376 0.9591 0.1648 0.0538 0.2674 0.1021 9.8336 0.5527 10.4297 18.8914 4.4240 8.6226 63.7592 8.3883 7.7251 24.1790 1.6658 0.4892 1.4212 0.3779 2.4692 5.9001 7.3588 7.1374 7.4055 3.4178 11.1336 21.8988 4.7103 13.1269 9.4528 7.1835 9.1483 1.9125 2.6756 19.5870 2.8143 55.5354 12.8697 10.6491 8.8014 9.0727 8.4869 0.6304 2.0760 1.6438 10.1893 3.9778 14.2583 93.1326 73.8191 11.3773 21.8544 27.0744 45.1805 8.6870 46.3610 17.8704 19.0430 38.7268 37.3537 53.1497 17.1057 40.1559 9.7541 6.3404 5.7537 0.5932 0.9394 12.4560 10.4811 20.2272 54.4504 21.4468 26.5781 26.1312 28.7037 23.1315 17.2729 7.1725
temp: 298.150 k
press: 1.00000 atm
elementType: 8 7 6 6 6 6 6 6 6 6 6 6 6 6 6 6 6 6 6 6 6 6 6 6 6 6 6 6 1 1 1 1 1 1 1 1 1 1 1 1 1 1 1 1 1 1 1 1 1 1 1 1 1 1 1 1 1 1 1
symmnumber: 1
zpe: 1311002.6 jmol-1
zpe.correction: 0.499335 hartree
zpe.thermalcorrener: 0.526610 hartree
zpe.thermalcorrenthalpy: 0.527554 hartree
zpe.thermalcorrgfe: 0.438620 hartree
zpe.sumelectzpe: -1137.262230 hartree
zpe.sumelectthermal: -1137.234954 hartree
zpe.sumelectthermalent: -1137.234010 hartree
zpe.sumelectthermalfe: -1137.322945 hartree
dipole: -1.7678 0.9437 0.2720
dipole: 2.0223
quadrupole: -159.6237 -163.4902 -156.8525
quadrupole: 1.5761 0.2459 1.8609
quadrupole: 0.3651 -3.5014 3.1363 1.5761 0.2459 1.8609
hfenergy: -1137.7615644 hartree
pointgroup: C01 [X(C26H31N1O1)]
dipole: 0.6684258 0.3684902 -0.2245904 debye
polarizability: 334.2848285|-1.4475838|271.8102786|-14.2263464|-8.8817523|245.6344238 unknown
InChI: InChI=1S/C26H31NO/c1-21(20-27(3)22(2)19-23-13-7-4-8-14-23)26(28,24-15-9-5-10-16-24)25-17-11-6-12-18-25/h4-18,21-22,28H,19-20H2,1-3H3
charge 0 multiplicity 1
59 atoms
O  1.525378 0.070485 1.772285
N  -1.339782 -0.220081 -1.380664
C  0.977319 -0.653871 -0.465084
C  2.112397 -0.001144 0.409878
C  -0.311925 0.219249 -0.404659
C  -2.754673 0.077584 -0.994401
C  0.655468 -2.109726 -0.07264
C  3.381653 -0.896032 0.462893
C  2.463955 1.42792 -0.082544
C  -3.191283 -0.818298 0.207044
C  -1.021149 0.184072 -2.764789
C  -3.050343 1.579077 -0.729003
C  4.450166 -0.755668 -0.459837
C  2.628661 1.72545 -1.461975
C  3.487166 -1.90457 1.459698
C  2.660551 2.478303 0.848396
C  -4.699373 -0.853254 0.40716
C  5.58315 -1.597015 -0.39373
C  2.983971 3.022312 -1.893152
C  4.623429 -2.740044 1.532575
C  3.02156 3.77651 0.422852
C  -5.321268 -0.153194 1.472706
C  -5.525674 -1.58489 -0.48737
C  5.678398 -2.592591 0.604135
C  3.188929 4.056321 -0.951745
C  -6.725209 -0.177404 1.640498
C  -6.928346 -1.612901 -0.325513
C  -7.535106 -0.906746 0.740194
H  1.357767 -0.662557 -1.50578
H  -0.041632 1.290487 -0.55333
H  -0.718093 0.130128 0.616659
H  -3.367789 -0.24185 -1.862256
H  1.494891 -2.794491 -0.281711
H  0.406505 -2.175997 1.001545
H  -0.223049 -2.437315 -0.655319
H  -2.700697 -0.463805 1.133631
H  -2.80546 -1.834076 -0.001992
H  -0.06564 -0.27035 -3.083634
H  -1.806458 -0.185267 -3.448683
H  -0.928803 1.290283 -2.904978
H  -2.777625 2.200629 -1.601434
H  -2.482939 1.947289 0.145705
H  -4.125263 1.73065 -0.525068
H  2.260576 0.199132 2.424703
H  4.416006 0.026588 -1.223097
H  2.463928 0.948848 -2.217193
H  2.664611 -2.046424 2.168185
H  2.500353 2.29523 1.91545
H  6.39644 -1.465456 -1.11657
H  3.098242 3.223641 -2.964458
H  4.67993 -3.509873 2.310738
H  3.164756 4.569648 1.165637
H  -4.698335 0.412194 2.1771
H  -5.061936 -2.145119 -1.309619
H  6.560357 -3.240472 0.658981
H  3.466104 5.062916 -1.283919
H  -7.185088 0.368691 2.472335
H  -7.547711 -2.187828 -1.023811
H  -8.62317 -0.929223 0.869075
