program: Gaussian 09
title: 000199316
version: EM64L-G09RevD.01
frameworkgroup: C1[X(C12H13BrN4O2S)]
method: RPBEPBE
basis: SDD
operation: Freq
keyword: #p
keyword: freq=noraman
keyword: PBEPBE/SDD
title: #p freq=noraman PBEPBE/SDD
converged: YES YES NO NO
title: Mulliken charges:
elementType: Br S O O N N N N C C C C C C C C C C C C H H H H H H H H H H H H H
charge: 0.003773 0.993890 -0.539476 -0.486009 -0.665563 -0.073618 -0.072357 -0.686376 -0.090463 0.446476 -0.222229 -0.143949 -0.423693 0.273086 -0.390865 -0.413524 0.516534 0.001280 -0.777641 -0.758346 0.356182 0.285020 0.284667 0.232741 0.232127 0.259719 0.250662 0.248246 0.231350 0.242514 0.252843 0.316429 0.316570
chargesum: 0.00000
title: Mulliken charges with hydrogens summed into heavy atoms:
elementType: Br S O O N N N N C C C C C C C C C C C C
charge: 0.003773 0.993890 -0.539476 -0.486009 -0.309380 -0.073618 -0.072357 -0.053378 -0.090463 0.446476 0.062791 0.140718 -0.423693 0.273086 -0.158124 -0.181397 0.516534 0.001280 -0.019013 -0.031640
polarizability: 2.79393993e+02 -2.00277903e+01 2.31598485e+02 1.35988569e+01 1.21064470e+01 1.48870268e+02
1716.lowfreq: -0.0010 -0.0009 0.0009 2.4771 4.1330 8.7524 21.5225 23.4511 51.4482
frequency: 21.2967 23.4439 51.4151 55.2013 57.5247 72.7516 82.7300 116.6773 126.2434 135.3083 166.1024 186.1870 216.0364 225.2836 231.7545 244.8068 266.0332 291.1789 302.3972 308.7652 327.3057 397.6873 403.5758 412.9036 415.5603 420.2091 440.9928 471.0882 516.3334 521.7521 528.2003 565.2926 598.7279 615.2301 622.7527 637.9936 644.9326 685.8929 718.5046 766.5105 802.4358 810.9448 817.1896 834.1954 925.5421 932.0462 948.4898 959.4200 965.2948 979.9655 998.9374 1021.9871 1034.0621 1041.2043 1051.3659 1057.1656 1082.1179 1133.1154 1185.2905 1214.9204 1276.8856 1303.2992 1324.7119 1329.5035 1365.0118 1392.0247 1394.8225 1401.8973 1436.4959 1437.4290 1445.4398 1460.1691 1462.7173 1463.5861 1487.0851 1490.4781 1531.5314 1585.7129 1614.0205 1648.1254 2990.7442 2995.6469 3069.1170 3077.0629 3126.8628 3132.6008 3135.5943 3137.9813 3165.4366 3181.4018 3497.3986 3561.7850 3700.5929
redmass: 6.9282 4.9898 3.0675 2.5673 1.4510 7.6130 6.4902 7.9528 1.0493 7.3749 5.4865 5.1407 6.3383 8.1548 5.3732 7.8342 6.3200 4.7100 5.3895 5.5429 5.5768 4.5569 3.7215 1.5457 1.4865 8.6632 1.3038 3.3004 1.5542 2.2312 6.6127 3.7299 6.3484 5.8870 6.7838 5.5234 5.5632 4.1628 2.9157 6.3761 5.9912 1.2943 8.6728 1.8312 2.9011 4.0962 1.3883 4.8784 1.5956 5.1633 5.1039 1.4479 1.6901 1.5779 2.5110 1.6009 2.7718 1.1934 1.1143 2.4807 2.5089 1.2870 2.5929 4.2467 3.1793 1.3607 1.4041 5.4748 3.0503 3.8218 2.1906 1.0570 1.1115 1.0545 2.6086 2.9465 7.7395 7.4214 4.7828 1.2273 1.0380 1.0378 1.0967 1.0971 1.0991 1.0993 1.0899 1.0896 1.0959 1.0949 1.0781 1.0452 1.1040
irintensity: 1.7553 1.0449 0.4009 0.1037 0.5284 0.6651 0.0644 2.0251 0.8069 0.5969 2.9465 1.7007 1.5148 7.3373 4.5649 0.9966 2.3515 26.8899 1.2469 5.4958 9.5871 14.6903 3.1292 0.0777 0.5138 93.2815 285.2231 154.7703 67.4998 69.1952 0.8950 1.1574 4.1198 21.3348 0.8894 29.6366 79.3443 149.4563 2.8812 5.5456 40.2507 2.3742 99.1237 85.1756 31.8658 30.7458 1.0287 79.2719 17.2072 9.9995 46.3968 1.9292 4.1752 11.3933 64.1370 1.0714 28.1485 12.2222 46.8515 30.0697 9.4324 4.1933 72.9619 18.8531 28.1414 58.4232 55.4676 5.7938 107.9448 6.1421 41.7691 18.3033 84.0230 37.2342 24.7416 74.5456 533.2090 11.7161 182.2418 274.6316 8.0533 10.7293 9.9272 13.1004 7.8589 11.9992 12.5058 13.3889 6.4103 4.9069 71.4967 120.5179 25.8518
temp: 298.150 k
press: 1.00000 atm
elementType: 35 16 8 8 7 7 7 7 6 6 6 6 6 6 6 6 6 6 6 6 1 1 1 1 1 1 1 1 1 1 1 1 1
symmnumber: 1
zpe: 623921.0 jmol-1
zpe.correction: 0.237639 hartree
zpe.thermalcorrener: 0.258567 hartree
zpe.thermalcorrenthalpy: 0.259511 hartree
zpe.thermalcorrgfe: 0.185565 hartree
zpe.sumelectzpe: -1244.437547 hartree
zpe.sumelectthermal: -1244.416618 hartree
zpe.sumelectthermalent: -1244.415674 hartree
zpe.sumelectthermalfe: -1244.489620 hartree
dipole: -4.3932 3.9118 -5.2500
dipole: 7.8845
quadrupole: -92.9365 -137.0953 -138.6127
quadrupole: -16.1430 17.1388 7.6495
quadrupole: 29.9450 -14.2138 -15.7312 -16.1430 17.1388 7.6495
hfenergy: -1244.6751855 hartree
pointgroup: C01 [X(C12H13Br1N4O2S1)]
dipole: -1.5004249 2.4069522 1.2560988 debye
polarizability: 252.6117089|6.5055295|157.4467769|-33.5316187|31.533464|249.8042605 unknown
InChI: InChI=1S/C12H13BrN4O2S/c1-7-11(13)12(16-8(2)15-7)17-20(18,19)10-5-3-9(14)4-6-10/h3-6,17H,14H2,1-2H3
charge 0 multiplicity 1
33 atoms
Br 2.428235 0.318082 -3.877762
S  -0.820883 -1.833864 -0.755825
O  -1.675833 -2.42335 -2.008989
O  0.016423 -2.81323 0.220897
N  0.342261 -0.717516 -1.711418
N  1.378565 0.148461 0.215631
N  3.425489 1.44676 0.085125
N  -4.492824 1.683404 2.502914
C  -1.909842 -0.706652 0.239433
C  1.383276 -0.017125 -1.143101
C  -3.101336 -0.256523 -0.358647
C  -1.546688 -0.397204 1.562442
C  2.429783 0.561593 -1.927374
C  3.44706 1.298012 -1.286498
C  -3.96481 0.547824 0.402651
C  -2.418004 0.402056 2.31877
C  -3.636541 0.890925 1.751147
C  2.39776 0.865248 0.773233
C  4.591714 1.944008 -2.025744
C  2.38378 1.018393 2.27425
H  0.336723 -0.954246 -2.711093
H  -3.349824 -0.549324 -1.383644
H  -0.605281 -0.771038 1.973912
H  -4.900645 0.908342 -0.03905
H  -2.161684 0.653841 3.354122
H  5.242082 2.452431 -1.298823
H  5.182232 1.193063 -2.582049
H  4.226798 2.677955 -2.76753
H  1.421734 1.445789 2.608924
H  2.490699 0.031529 2.759975
H  3.20999 1.670522 2.592225
H  -5.364292 2.029416 2.111259
H  -4.270916 1.926718 3.46424
