program: Gaussian 09
title: 000199290
version: EM64L-G09RevD.01
frameworkgroup: C1[X(C15H16N2O2)]
method: RPBEPBE
basis: SDD
operation: Freq
keyword: #p
keyword: freq=noraman
keyword: PBEPBE/SDD
title: #p freq=noraman PBEPBE/SDD
converged: YES YES NO NO
title: Mulliken charges:
elementType: O O N N C C C C C C C C C C C C C C C H H H H H H H H H H H H H H H H
charge: -0.439216 -0.326721 -0.167522 -0.519046 0.450397 0.488848 -0.600635 0.312118 -0.387283 -0.433167 0.051546 -0.222743 -0.372113 -0.642785 -0.646628 -0.301525 -0.218491 -0.261438 0.142134 0.252519 0.366012 0.237918 0.266642 0.217478 0.274474 0.232325 0.215562 0.232653 0.233493 0.235968 0.216434 0.272327 0.226603 0.231288 0.382574
chargesum: 0.00000
title: Mulliken charges with hydrogens summed into heavy atoms:
elementType: O O N N C C C C C C C C C C C C C C C
charge: -0.056641 -0.326721 -0.167522 -0.153034 0.450397 0.488848 -0.348117 0.312118 -0.149364 -0.166525 0.051546 -0.005265 -0.097639 0.037755 0.039267 -0.029198 0.008112 -0.030150 0.142134
polarizability: 3.21392949e+02 6.05830968e+00 2.05518310e+02 -4.51882621e+00 6.42798637e-01 9.99343434e+01
1716.lowfreq: -9.5974 -5.4763 -3.2687 -0.0005 0.0003 0.0005 24.5676 37.3788 53.8796
frequency: 24.4891 37.2527 53.8588 79.2788 92.5060 103.2001 132.1043 145.1885 176.3928 186.6417 200.9030 239.0054 262.5332 281.3659 285.8319 337.4404 381.5832 402.4617 422.6279 453.0662 484.8846 502.2733 519.1035 536.9871 567.1808 581.4293 588.9802 607.1401 651.8948 679.5552 689.1931 719.4942 738.6036 763.1502 769.0470 776.3229 801.0585 815.1090 845.8836 855.2578 882.1851 904.1405 956.5479 969.1516 972.6397 991.4109 996.5658 1005.7028 1041.5548 1056.4733 1099.8811 1109.4068 1109.7218 1113.5078 1159.8770 1166.4670 1177.2993 1188.2076 1221.4055 1252.8388 1268.0813 1317.2269 1324.6595 1338.2633 1365.3294 1385.9232 1398.2667 1428.4799 1432.5725 1444.2921 1457.4292 1463.1744 1467.5276 1474.4330 1492.6622 1502.7004 1510.5588 1526.6470 1577.4028 1580.3727 1615.9868 1621.4737 1641.2033 2934.3703 2943.0368 2998.8489 3001.4856 3092.8072 3103.3072 3128.9302 3131.4729 3155.9584 3159.7736 3167.3055 3174.7350 3178.1758 3182.5963 3280.9441 3533.3538
redmass: 4.8851 4.2368 3.2779 4.1085 2.3634 6.1551 2.5942 1.8973 3.1499 3.4904 1.6978 3.6525 3.6215 2.7491 5.4568 4.6665 4.0468 6.1938 3.1365 2.9990 4.0847 6.5547 3.1326 3.5924 1.1957 5.7332 4.8649 4.9430 5.0545 3.5592 2.2689 5.2688 2.6315 1.6925 2.5018 1.5594 1.4411 4.0704 1.7043 1.7098 1.3851 4.3045 1.3137 3.9214 1.3986 1.3489 2.6410 5.1689 2.1739 1.5010 1.7499 1.2785 1.2799 1.8043 1.5308 1.5914 1.1086 1.1055 2.0588 1.5638 3.2471 1.9583 1.6267 2.3514 3.2590 6.2581 6.1841 2.4814 1.2350 2.7867 1.3871 1.0417 2.1402 1.0464 1.2375 1.6378 1.3860 3.2767 5.5226 6.7831 3.0239 5.5060 3.4442 1.0368 1.0396 1.0991 1.1031 1.0959 1.0938 1.0875 1.0873 1.0903 1.0900 1.0918 1.0946 1.0961 1.0974 1.0793 1.0640
irintensity: 1.2590 0.8447 0.2605 0.9360 5.6992 0.0082 0.1165 0.8612 0.6574 0.5812 0.5352 1.5479 6.1452 3.2852 1.7089 1.9126 1.1101 6.7799 13.1056 7.6392 0.6619 23.9785 11.9623 0.4112 114.2796 11.7970 9.3653 35.3806 1.3017 55.5081 9.3392 0.2692 9.5978 116.6824 2.7682 25.0027 66.4637 5.9679 26.9439 46.9363 3.2178 3.6500 3.4703 0.1931 2.0553 4.2135 28.9937 314.8988 34.3630 23.7274 30.0264 1.2307 0.5952 168.0932 31.1929 137.8328 0.6586 21.6712 14.9214 13.9055 14.2994 66.8774 29.5723 228.3052 40.7907 7.1813 13.7898 25.3240 11.9079 97.5275 93.1787 0.8294 52.1612 20.8115 49.1567 46.0518 386.8782 60.9514 148.5105 207.4678 230.0120 470.7452 114.4623 111.2984 85.1566 0.4238 93.4756 4.3685 53.2429 14.7895 12.1332 14.6523 7.6610 16.9333 1.7705 11.6762 12.8968 146.5272 63.6136
temp: 298.150 k
press: 1.00000 atm
elementType: 8 8 7 7 6 6 6 6 6 6 6 6 6 6 6 6 6 6 6 1 1 1 1 1 1 1 1 1 1 1 1 1 1 1 1
symmnumber: 1
zpe: 735506.2 jmol-1
zpe.correction: 0.280140 hartree
zpe.thermalcorrener: 0.297694 hartree
zpe.thermalcorrenthalpy: 0.298638 hartree
zpe.thermalcorrgfe: 0.233620 hartree
zpe.sumelectzpe: -839.796622 hartree
zpe.sumelectthermal: -839.779068 hartree
zpe.sumelectthermalent: -839.778124 hartree
zpe.sumelectthermalfe: -839.843142 hartree
dipole: 2.5341 0.4258 0.8636
dipole: 2.7108
quadrupole: -86.7452 -100.1936 -116.2340
quadrupole: 3.2987 2.2854 1.5066
quadrupole: 14.3124 0.8640 -15.1764 3.2987 2.2854 1.5066
hfenergy: -840.0767615 hartree
pointgroup: C01 [X(C15H16N2O2)]
dipole: 0.9989679 0.116883 0.3547886 debye
polarizability: 321.5336435|5.0023126|203.9990395|-3.9255866|12.0100456|101.3129198 unknown
InChI: InChI=1S/C15H16N2O2/c1-17(2)12-7-5-6-11(10-12)16-14-9-4-3-8-13(14)15(18)19/h3-10,16,18H,1-2H3
charge 0 multiplicity 1
35 atoms
O  -4.08439 2.539962 -0.176417
O  -1.774639 2.613007 -0.209073
N  4.375915 0.68422 0.505516
N  -0.453386 0.288343 -0.057437
C  3.279068 -0.040511 0.024381
C  0.829366 -0.301266 -0.254224
C  1.94459 0.419866 0.238611
C  -1.681285 -0.330006 0.134355
C  3.459249 -1.269459 -0.689544
C  1.022276 -1.507501 -0.979189
C  -2.896793 0.462188 0.106514
C  2.340333 -1.971367 -1.176042
C  -1.806861 -1.730409 0.406669
C  5.738268 0.190908 0.274285
C  4.167095 1.946425 1.22367
C  -4.160116 -0.169481 0.299194
C  -3.064435 -2.317328 0.601637
C  -4.258287 -1.546738 0.534436
C  -2.833002 1.910387 -0.101273
H  1.756554 1.338459 0.801841
H  -0.509504 1.322322 -0.094181
H  4.460913 -1.666583 -0.871702
H  0.176137 -2.036155 -1.424677
H  2.500176 -2.897144 -1.741165
H  -0.903853 -2.3380 0.497709
H  5.898819 -0.808124 0.729358
H  6.461671 0.887376 0.727008
H  5.972435 0.112669 -0.807604
H  3.575112 1.801945 2.15103
H  3.639369 2.695468 0.59782
H  5.142134 2.371828 1.509231
H  -5.055053 0.457777 0.264324
H  -3.120663 -3.389986 0.820998
H  -5.234418 -2.018869 0.680628
H  -3.929497 3.513077 -0.30989
