program: Gaussian 09
title: 000199279
version: EM64L-G09RevD.01
frameworkgroup: C1[X(C13H11NS)]
method: RPBEPBE
basis: SDD
operation: Freq
keyword: #p
keyword: freq=noraman
keyword: PBEPBE/SDD
title: #p freq=noraman PBEPBE/SDD
converged: YES YES NO NO
title: Mulliken charges:
elementType: S N C C C C C C C C C C C C C H H H H H H H H H H H
charge: 0.205933 -0.496328 0.547937 -0.334381 0.533886 -0.321610 -0.418886 0.466785 -0.399741 -0.425838 -0.403072 -0.274997 -0.810917 -0.212606 -0.256804 0.294744 0.243780 0.222800 0.232322 0.223616 0.241501 0.227708 0.230621 0.230190 0.222740 0.230617
chargesum: 0.00000
title: Mulliken charges with hydrogens summed into heavy atoms:
elementType: S N C C C C C C C C C C C C C
charge: 0.205933 -0.201584 0.547937 -0.334381 0.533886 -0.321610 -0.175106 0.466785 -0.176940 -0.193516 -0.179457 -0.033496 -0.127365 0.015102 -0.026187
polarizability: 2.82014265e+02 -1.15565797e+00 1.62199772e+02 4.14179290e+00 -1.55542006e+00 7.13456384e+01
1716.lowfreq: -15.7422 -7.6751 -4.0209 0.0015 0.0025 0.0026 10.3823 34.0323 102.9901
frequency: -13.2719 34.0314 102.9886 151.8251 165.7502 198.3289 250.0970 292.0202 317.4312 337.4675 401.4138 416.4367 422.8590 435.4039 475.2288 514.3504 537.6696 544.3207 564.8562 633.6444 661.9689 676.8652 711.9590 720.2335 748.7716 785.1110 808.7306 843.2394 853.1221 879.1117 888.4565 923.8591 932.6913 965.2848 994.9669 1026.1806 1043.9435 1046.4067 1054.6909 1124.3322 1150.1019 1170.5678 1219.2613 1239.9271 1244.9022 1279.1452 1295.2304 1352.9088 1383.9317 1398.2193 1399.0829 1422.6724 1469.5197 1471.9212 1479.9687 1496.9563 1500.4882 1585.9004 1588.9158 1599.9666 1625.4360 2974.1441 3050.8631 3082.4856 3112.7625 3115.3147 3125.9404 3135.9588 3142.2810 3147.0405 3169.7218 3550.6187
redmass: 1.0343 5.7095 3.6724 4.4757 4.0453 4.8521 4.4167 4.5838 4.4992 4.4164 4.1292 6.7490 4.4802 3.3484 4.8878 2.0391 4.1943 2.7198 2.5934 5.0885 6.6180 7.0387 3.3194 3.3014 1.3558 4.6394 1.4451 1.4772 4.8998 1.3925 5.1746 1.3786 1.3621 1.3136 1.4197 4.7781 2.2118 1.5258 3.4154 1.5932 1.3140 1.0565 1.9509 1.6348 2.6143 1.4209 2.1986 3.0196 6.5248 1.2780 3.8591 2.4674 1.0488 1.2579 2.7688 2.1567 2.5362 4.8555 6.4577 4.9790 7.2376 1.0372 1.0978 1.0984 1.0878 1.0882 1.0916 1.0874 1.0961 1.0935 1.1004 1.0759
irintensity: 0.3714 0.6857 0.1383 0.0992 2.4380 1.0649 3.9750 0.5122 1.0141 0.4826 1.6916 2.7421 5.2814 0.5492 17.9831 34.4210 8.8868 22.0185 3.2870 9.3325 8.9062 2.2276 4.2561 4.8879 105.6684 7.2250 61.7486 3.8326 8.5630 5.1289 1.3893 3.0210 1.7424 0.1322 3.6667 31.0386 0.6396 11.0794 4.5024 17.3912 12.7241 1.0511 1.4947 1.0298 3.1910 7.6782 32.2813 95.5597 19.4607 4.1367 0.4971 6.5700 15.7155 94.9400 270.6730 166.2663 106.6632 29.0669 9.8922 15.8072 9.1761 56.4566 22.4284 20.0061 15.1631 12.2883 8.1517 0.3841 22.7007 21.0622 27.3141 16.9917
temp: 298.150 k
press: 1.00000 atm
elementType: 16 7 6 6 6 6 6 6 6 6 6 6 6 6 6 1 1 1 1 1 1 1 1 1 1 1
symmnumber: 1
zpe: 529157.4 jmol-1
zpe.correction: 0.201545 hartree
zpe.thermalcorrener: 0.213295 hartree
zpe.thermalcorrenthalpy: 0.214239 hartree
zpe.thermalcorrgfe: 0.163401 hartree
zpe.sumelectzpe: -953.770236 hartree
zpe.sumelectthermal: -953.758487 hartree
zpe.sumelectthermalent: -953.757543 hartree
zpe.sumelectthermalfe: -953.808380 hartree
dipole: -0.4214 2.1171 0.4500
dipole: 2.2050
quadrupole: -81.2035 -82.7120 -102.3840
quadrupole: 1.7763 0.4492 -2.0059
quadrupole: 7.5630 6.0545 -13.6175 1.7763 0.4492 -2.0059
hfenergy: -953.9717818 hartree
pointgroup: C01 [X(C13H11N1S1)]
dipole: -0.1711795 -0.807858 -0.2658407 debye
dipolederiv: -0.5582763 -0.0214655 0.0092959 -0.0361825 -0.0550399 0.0275189 0.0103488 -0.0566113 -0.0365427 -1.9296158 -0.0749125 0.0244589 -0.1167276 -0.2007611 0.0651256 0.0353805 0.1682316 -0.390704 1.2738365 -0.3135774 0.0524135 -0.8298841 -0.0674871 -0.0520988 -0.012288 -0.0988256 0.097997 0.3747399 0.2496306 0.1553273 0.8408928 0.0750168 0.0516157 0.0961226 0.0624026 -0.0487013 1.1821799 0.4300002 -0.0897577 0.985855 0.0932599 -0.0944397 -0.0462537 -0.1194503 0.1228538 0.4507223 -0.2258045 -0.1850905 -0.8181345 -0.0686823 0.0641648 -0.1226491 0.0677504 -0.0491279 -0.2037143 0.0313697 0.0099445 -0.1756756 0.0740877 0.0022482 -0.0216015 0.0293133 -0.1375311 0.1819875 -0.1361126 0.0265081 -0.2065339 -0.0515737 -0.0351359 0.0455756 -0.0155327 -0.0440177 -0.2815077 0.1672485 0.0473293 -0.1795115 0.0871724 0.002765 -0.0009108 0.0373087 -0.1844438 -0.0715994 -0.0636449 0.0028804 0.1768859 0.0801642 0.0455855 0.0524457 0.0129935 -0.1699767 -0.3652442 -0.1960979 -0.0369386 0.131699 0.0738117 -0.0107579 0.0085941 0.043462 -0.2011088 -0.0379378 0.0041833 -0.0229215 0.1465644 0.0975291 -0.0073306 -0.0042551 0.0175969 -0.1074153 -0.0309628 0.0580672 -0.012915 0.1187569 0.028962 0.0119402 0.0002334 0.0061898 0.0774592 0.0545132 0.0673553 -0.0269384 -0.052395 0.1276115 0.0345438 -0.0684034 0.0008755 -0.1415714 -0.1623459 0.0559362 -0.0249349 0.044322 -0.114041 -0.0212145 -0.0364478 -0.0079397 -0.1912624 0.1053649 -0.0022128 0.0048402 0.000161 0.1200897 -0.0049983 0.0082834 -0.0461025 0.3075926 0.1092791 0.0059087 -0.0130491 0.0435456 -0.0671625 -0.0041764 -0.0128927 -0.0173157 0.1416812 0.0525251 0.078309 -0.0143764 0.0357151 -0.1148273 -0.0172964 -0.0071534 -0.0188869 0.1641585 -0.0746023 -0.107542 -0.0351764 -0.104527 0.0204344 -0.0210065 -0.0448925 -0.0227049 0.1488218 0.0694621 -0.0566976 0.0207711 -0.0014782 -0.122642 -0.0148434 0.0134641 -0.0133424 0.1649537 0.1160249 0.0324894 0.0166267 -0.0157594 -0.0718772 -0.0018803 0.0158512 -0.0200702 0.1473625 -0.0792436 0.0912613 0.0459512 0.1095828 0.0318176 -0.0247276 0.0586307 -0.0214353 0.150653 -0.0307746 0.0494485 0.0186265 0.0953474 0.0345639 -0.0966984 0.1040637 -0.1067642 -0.0506873 0.0047116 0.0111855 0.0078704 0.0733008 -0.005462 0.1284594 -0.0791795 0.1259208 -0.0359054 -0.0546777 -0.0544085 -0.0278345 -0.1777986 -0.0430667 -0.0386766 -0.0426418 -0.020757 0.100256 -0.0948448 -0.0799172 0.0470889 -0.088021 0.0381017 0.0113141 0.0505755 0.0136934 0.1652066 unknown
polarizability: 282.0411775|0.7252039|161.4644269|-3.6492535|8.2270414|72.0540711 unknown
InChI: InChI=1S/C13H11NS/c1-9-6-7-11-13(8-9)15-12-5-3-2-4-10(12)14-11/h2-8,14H,1H3
charge 0 multiplicity 1
26 atoms
S  0.257911 1.761667 0.801787
N  0.443688 -1.340099 0.425461
C  -0.854083 -0.800007 0.272708
C  -1.093791 0.599038 0.343472
C  1.65382 -0.645773 0.212683
C  1.718082 0.773551 0.274145
C  -2.389032 1.11386 0.15491
C  -3.501292 0.257541 -0.066182
C  -1.956694 -1.657363 0.035525
C  -3.260344 -1.135989 -0.114399
C  2.841096 -1.369251 -0.075016
C  2.931514 1.44423 0.025589
C  -4.896675 0.831386 -0.240229
C  4.06348 -0.696548 -0.285629
C  4.113733 0.714531 -0.245174
H  0.50589 -2.359002 0.423715
H  -2.543242 2.198977 0.19656
H  -1.789555 -2.739869 -0.031749
H  -4.09628 -1.824538 -0.283086
H  2.799353 -2.464339 -0.132512
H  2.956888 2.538932 0.060446
H  4.969795 -1.275591 -0.492728
H  -5.222825 1.385479 0.660418
H  -4.941024 1.538254 -1.090221
H  -5.636545 0.034384 -0.428327
H  5.055135 1.244842 -0.419466
