program: Gaussian 09
title: 000199269
version: EM64L-G09RevD.01
frameworkgroup: C1[X(C16H16N2O2)]
method: RPBEPBE
basis: SDD
operation: Freq
keyword: #p
keyword: freq=noraman
keyword: PBEPBE/SDD
title: #p freq=noraman PBEPBE/SDD
converged: YES YES NO NO
title: Mulliken charges:
elementType: O O N N C C C C C C C C C C C C C C C C H H H H H H H H H H H H H H H H
charge: -0.195970 -0.197313 -0.066413 -0.219574 -0.462249 -0.447882 -0.427952 -0.432451 -0.415830 -0.013501 0.174551 0.177781 -0.448573 0.113139 0.101955 0.052174 -0.352057 -0.351571 -0.211162 -0.211452 0.221695 0.228286 0.227827 0.220387 0.224712 0.221239 0.257491 0.221695 0.244354 0.219607 0.267019 0.261359 0.269900 0.270093 0.239301 0.239384
chargesum: 0.00000
title: Mulliken charges with hydrogens summed into heavy atoms:
elementType: O O N N C C C C C C C C C C C C C C C C
charge: -0.195970 -0.197313 -0.066413 -0.219574 -0.012268 0.000332 0.017999 0.046736 0.048131 -0.013501 0.174551 0.177781 0.079805 0.113139 0.101955 0.052174 -0.082156 -0.081478 0.028139 0.027932
polarizability: 2.37031962e+02 1.29005429e+01 1.86688479e+02 2.24026300e+01 -1.47799649e+01 1.40419273e+02
1716.lowfreq: -29.0840 -5.1955 -0.0005 -0.0004 0.0001 2.7551 7.9354 9.6980 24.1080
frequency: -24.3422 9.4610 23.3808 29.5588 46.0441 72.8885 105.1044 136.9456 137.7005 170.3625 209.8088 226.0601 244.8420 253.5584 289.0089 328.9334 348.8721 366.5146 394.7798 412.3308 455.7456 472.2932 522.9396 553.8757 607.3514 629.0022 637.4007 659.2427 677.9552 696.8361 718.1418 751.0067 785.5081 785.8563 799.5669 826.4950 827.9326 839.1408 874.2311 903.7315 907.2305 929.6671 929.9649 942.7998 970.9892 975.3382 1006.9690 1008.3745 1014.7751 1040.8946 1063.7479 1071.7164 1091.2321 1104.1978 1160.8174 1169.7550 1171.1104 1172.4130 1187.6595 1203.1676 1216.3805 1230.7254 1240.2042 1279.6814 1282.9741 1297.2917 1300.7785 1307.6902 1316.6626 1322.4013 1348.4553 1365.2920 1416.1087 1437.0249 1453.9767 1454.1068 1456.8777 1461.6003 1469.5951 1474.4121 1487.6774 1614.5541 1618.5208 1632.2028 1679.4219 2291.2262 2847.1103 2994.9011 3001.5165 3001.8020 3002.1395 3007.8270 3017.9125 3053.5630 3057.0034 3068.4707 3080.1987 3091.8255 3139.6535 3153.1165 3164.7385 3174.6453
redmass: 2.6122 6.5591 2.7168 3.1504 4.0975 4.0259 5.9286 3.7273 4.9621 6.6106 4.2393 3.2111 6.6202 2.7367 3.8205 8.2076 3.8471 2.4821 4.1409 3.2110 4.8716 5.0960 7.2066 8.3822 7.6168 2.6090 2.5228 4.8297 6.3018 5.3049 3.2252 2.0906 4.0202 2.9905 2.0874 3.0526 1.7944 2.6145 3.5572 2.5932 1.3902 1.9114 2.8033 5.7409 1.8253 1.4118 1.3466 2.8465 2.0539 2.1123 2.1982 2.6012 2.8319 2.7199 2.2040 1.3059 1.8598 1.4907 1.1938 2.9220 1.1385 1.2160 1.4115 1.3491 1.4789 1.2136 1.5143 1.4318 1.3140 2.4769 1.4341 1.7020 6.0954 1.1210 2.5529 2.5857 1.0816 1.0830 1.0795 1.0836 1.0934 7.6940 7.8809 11.9032 12.0086 11.7549 1.0701 1.0619 1.0633 1.0632 1.0582 1.0844 1.0647 1.1009 1.1024 1.1025 1.1026 1.1045 1.0864 1.0906 1.0956 1.1004
irintensity: 0.0923 0.2888 0.2554 0.2614 2.2302 0.6846 4.0448 0.6182 0.0212 3.8907 2.1927 4.4232 0.9397 8.1111 1.2913 16.7828 1.6631 2.8013 2.2341 0.7795 0.0574 14.3508 8.3425 3.9508 26.1439 7.0002 5.7803 0.0079 0.7284 13.4275 60.8746 24.3891 6.7418 17.3586 15.8701 2.9074 1.8897 10.5011 14.3342 1.0159 0.0283 29.1405 34.8203 6.8752 2.9823 2.1788 0.0093 22.5260 1.4213 18.4253 10.0583 22.3990 25.5875 9.7730 14.3466 2.8997 3.6548 5.2840 0.9737 7.7821 2.6681 11.2466 5.6138 7.0741 1.1971 2.0627 113.9446 10.3130 52.2914 244.5840 15.4941 72.7442 6.7238 50.8343 6.2330 6.8051 5.4868 4.3117 7.6279 10.9886 9.1445 1.8709 74.3583 389.6678 48.6329 4.6466 61.3191 38.5945 30.1260 54.2601 19.6085 16.1683 40.3846 17.3080 0.9040 6.3410 32.5479 75.4364 1.6970 5.1493 5.7727 21.0788
temp: 298.150 k
press: 1.00000 atm
elementType: 8 8 7 7 6 6 6 6 6 6 6 6 6 6 6 6 6 6 6 6 1 1 1 1 1 1 1 1 1 1 1 1 1 1 1 1
symmnumber: 1
zpe: 749254.0 jmol-1
zpe.correction: 0.285376 hartree
zpe.thermalcorrener: 0.302685 hartree
zpe.thermalcorrenthalpy: 0.303629 hartree
zpe.thermalcorrgfe: 0.236482 hartree
zpe.sumelectzpe: -877.762375 hartree
zpe.sumelectthermal: -877.745066 hartree
zpe.sumelectthermalent: -877.744122 hartree
zpe.sumelectthermalfe: -877.811269 hartree
dipole: -1.7221 -2.8547 -1.8146
dipole: 3.7958
quadrupole: -92.9252 -116.4358 -119.1904
quadrupole: 8.2212 -3.2884 4.4405
quadrupole: 16.5919 -6.9187 -9.6732 8.2212 -3.2884 4.4405
hfenergy: -878.0477507 hartree
pointgroup: C01 [X(C16H16N2O2)]
dipole: 0.6712281 -1.1880552 0.6067305 debye
polarizability: 235.6310606|-15.3988683|182.1785774|24.2428688|19.4242648|146.3300749 unknown
InChI: InChI=1S/C16H16N2O2/c19-15-13-7-1-2-8-14(13)16(20)18(15)12-6-5-11-17-9-3-4-10-17/h1-2,7-8H,3-4,9-12H2
charge 0 multiplicity 1
36 atoms
O  0.781474 -0.548343 -1.919169
O  2.327912 2.493914 1.329521
N  -4.388488 0.294813 -0.334109
N  1.293963 1.185537 -0.370038
C  -5.464201 -1.605155 0.79811
C  -4.20118 -2.129684 0.035583
C  -5.702128 -0.171406 0.204515
C  -3.803458 -0.949181 -0.920433
C  -3.538374 0.89993 0.740606
C  -2.226406 1.346302 0.243453
C  2.690362 -0.675294 -0.319106
C  3.156084 0.23885 0.657772
C  0.191467 2.109786 -0.701088
C  1.489832 -0.082082 -0.994427
C  2.268717 1.446882 0.640025
C  -1.113583 1.689874 -0.159933
C  3.331784 -1.903329 -0.537297
C  4.278822 -0.04531 1.449381
C  4.467683 -2.201581 0.259881
C  4.933815 -1.286748 1.238058
H  -6.344408 -2.253943 0.64584
H  -5.27593 -1.556306 1.885762
H  -3.382472 -2.363445 0.739235
H  -4.415197 -3.049754 -0.535796
H  -6.41484 -0.22971 -0.639527
H  -6.105378 0.548482 0.93788
H  -2.716151 -0.83618 -1.061446
H  -4.258652 -1.101183 -1.916895
H  -4.088893 1.771484 1.144028
H  -3.361498 0.207576 1.60315
H  0.125664 2.185405 -1.802315
H  0.481509 3.098279 -0.298426
H  2.963595 -2.600481 -1.296443
H  4.630771 0.66922 2.199971
H  4.994214 -3.151589 0.11916
H  5.813169 -1.544129 1.838117
