program: Gaussian 09
title: 000199241
version: EM64L-G09RevD.01
frameworkgroup: C1[X(C11H17NO)]
method: RPBEPBE
basis: SDD
operation: Freq
keyword: #p
keyword: freq=noraman
keyword: PBEPBE/SDD
title: #p freq=noraman PBEPBE/SDD
converged: YES YES NO NO
title: Mulliken charges:
elementType: O N C C C C C C C C C C C H H H H H H H H H H H H H H H H H
charge: -0.194822 -0.077938 -0.126947 -0.462767 -0.429222 -0.500316 0.118230 -0.532555 0.009423 -0.412063 -0.058331 -0.623512 -0.614551 0.265005 0.204470 0.252020 0.226562 0.214344 0.240058 0.254095 0.239102 0.267063 0.237991 0.210991 0.248388 0.221893 0.184341 0.227888 0.225322 0.185838
chargesum: 0.00000
title: Mulliken charges with hydrogens summed into heavy atoms:
elementType: O N C C C C C C C C C C C
charge: -0.194822 -0.077938 0.138057 -0.006276 0.011684 -0.006163 0.118230 -0.026391 0.009423 0.036919 -0.058331 0.031110 0.024498
polarizability: 1.69330003e+02 -3.90189807e+00 1.13484074e+02 6.95430916e+00 3.50545387e-01 9.41677225e+01
1716.lowfreq: -17.1034 -11.7340 -4.6522 -3.7675 -0.0008 -0.0008 0.0005 27.3421 41.5047
frequency: -14.5754 27.3243 41.4810 73.3287 90.6753 101.9623 177.1258 206.4662 237.3505 245.3850 254.6437 273.7126 310.6537 339.3437 352.6593 374.6576 400.4998 477.1143 522.9547 536.0049 565.2526 601.2428 733.6309 787.4239 806.7643 827.5983 838.8038 909.7431 925.7933 940.0736 967.9882 999.2976 1014.2754 1027.2278 1034.4179 1090.7211 1106.3611 1112.0873 1132.4389 1151.2032 1159.7098 1169.7124 1172.3334 1195.6901 1216.2877 1249.7976 1251.8585 1265.1914 1267.8038 1285.2931 1302.8335 1315.2729 1321.9798 1355.3005 1415.5698 1427.7688 1437.8131 1452.6798 1453.8870 1458.9792 1472.0831 1474.4775 1475.8402 1481.9114 1485.4125 1652.1161 2282.2501 2810.6662 2842.1315 2858.0108 2952.7885 2972.6172 2989.1442 2991.1217 2999.1258 3004.8857 3019.2260 3025.8154 3030.2797 3065.7971 3076.5562 3078.9230 3086.2530 3090.6137
redmass: 3.0807 4.2292 3.2571 2.8606 3.3324 3.6091 3.1127 2.1422 1.1468 1.5800 1.6608 4.0644 2.4322 2.3079 2.3752 4.1193 2.9387 3.9556 2.7027 3.3133 5.3928 2.6008 2.5790 4.1919 3.7924 1.8132 2.1184 1.8348 1.9608 1.6366 1.6758 1.8195 2.2937 2.2825 1.5208 1.2600 1.4549 2.5613 1.3846 2.3910 1.5099 2.7733 1.8964 1.4317 1.5328 1.8489 1.4262 1.6014 1.3729 1.3242 1.3022 1.5170 1.6675 1.4671 1.1399 1.0788 1.1693 1.0841 1.0748 1.0472 1.0620 1.0750 1.0606 1.0951 1.0533 12.4372 11.7409 1.0705 1.0576 1.0572 1.0798 1.0606 1.0650 1.0675 1.0844 1.0636 1.0715 1.0992 1.0719 1.0953 1.0988 1.1010 1.1017 1.1009
irintensity: 1.6398 1.2058 0.7089 1.4175 3.2850 2.1621 6.5033 1.1829 1.0078 8.3432 1.5711 0.9755 13.7212 0.9646 0.2110 1.2672 0.8172 7.4625 2.8986 1.5123 7.2714 1.5554 1.7004 9.0076 15.9523 7.6244 10.0763 0.7859 15.1031 10.9128 1.5132 5.5788 55.2521 0.5913 13.4688 7.4972 8.7995 5.8377 6.2092 47.0267 27.1558 2.9585 7.6106 5.1202 8.2827 14.6710 4.2877 5.9670 4.3245 2.6099 2.5056 6.0280 18.4467 42.1917 3.6559 20.8103 6.8059 11.7328 2.0069 15.1844 9.8031 23.9398 5.1606 4.1353 15.4108 177.8297 5.8506 69.9277 80.8334 233.8593 5.4030 14.9045 14.3744 26.7995 23.2425 37.2655 43.8614 11.4961 37.2889 13.1301 24.7749 30.3282 37.7331 32.5091
temp: 298.150 k
press: 1.00000 atm
elementType: 8 7 6 6 6 6 6 6 6 6 6 6 6 1 1 1 1 1 1 1 1 1 1 1 1 1 1 1 1 1
symmnumber: 1
zpe: 669965.6 jmol-1
zpe.correction: 0.255176 hartree
zpe.thermalcorrener: 0.268968 hartree
zpe.thermalcorrenthalpy: 0.269912 hartree
zpe.thermalcorrgfe: 0.213501 hartree
zpe.sumelectzpe: -558.247521 hartree
zpe.sumelectthermal: -558.233730 hartree
zpe.sumelectthermalent: -558.232785 hartree
zpe.sumelectthermalfe: -558.289197 hartree
dipole: -1.8484 2.4360 0.2045
dipole: 3.0647
quadrupole: -77.0521 -83.1056 -76.3898
quadrupole: 12.5671 -0.0984 1.6206
quadrupole: 1.7970 -4.2564 2.4594 12.5671 -0.0984 1.6206
hfenergy: -558.5026975 hartree
pointgroup: C01 [X(C11H17N1O1)]
dipole: -0.7116662 -0.9729177 0.0272761 debye
polarizability: 169.3116499|3.9856195|113.4159752|-6.8218388|-1.9940272|94.2541749 unknown
InChI: InChI=1S/C11H17NO/c1-12(2)9-4-3-6-10-7-5-8-11(10)13/h10H,5-9H2,1-2H3
charge 0 multiplicity 1
30 atoms
O  3.800908 1.53993 -0.238125
N  -3.731745 -0.55249 0.14419
C  1.751341 0.204135 0.205612
C  1.570464 -1.320602 0.003611
C  2.901934 -1.92831 0.534932
C  3.987467 -0.922478 0.0743
C  3.261872 0.429552 -0.010951
C  0.880452 1.141606 -0.669164
C  -0.556554 1.03841 -0.362951
C  -3.191188 0.832251 0.233094
C  -1.756092 0.924992 -0.094358
C  -3.606465 -1.125585 -1.211372
C  -5.117331 -0.609771 0.651344
H  1.55164 0.445179 1.273144
H  1.454915 -1.540859 -1.076537
H  0.679725 -1.712864 0.520567
H  3.078986 -2.950171 0.159218
H  2.876067 -1.980256 1.639893
H  4.359968 -1.167614 -0.941106
H  4.873822 -0.854818 0.728888
H  1.056088 0.904415 -1.737836
H  1.232742 2.181485 -0.521881
H  -3.348999 1.186477 1.270865
H  -3.755927 1.53805 -0.434483
H  -2.547782 -1.106975 -1.52059
H  -3.947442 -2.175905 -1.198421
H  -4.204433 -0.572594 -1.981159
H  -5.468926 -1.656504 0.642556
H  -5.150164 -0.24844 1.695132
H  -5.840043 0.000453 0.049588
